UnstableConsole Output

Skipping 1,799 KB.. Full Log
    [ Message content over the limit has been removed. ]
...--------------------+---------------+\nTo get the history of all operations over a NS, run "osm ns-op-list NS_ID"\nFor more details on the current operation, run "osm ns-op-show OPERATION_ID"\' does not contain any of \'READY\' or \'BROKEN\'', '${PREV_TEST_NAME}': 'Network Service Instance Test', '${PREV_TEST_STATUS}': 'FAIL', '${privatekey}': '/root/.ssh/id_rsa', '${publickey}': '/root/.ssh/id_rsa.pub', '${REPORT_FILE}': '/robot-systest/reports/report.html', '${SPACE}': ' ', '${success_return_code}': '0', '${SUITE_DOCUMENTATION}': '[HEAL-01] Healing of a multi-volume VDU', '${SUITE_NAME}': 'Testsuite.Heal 01-Volume Vdu Healing', '${SUITE_SOURCE}': '/robot-systest/testsuite/heal_01-volume_vdu_healing.robot', '${TEMPDIR}': '/tmp', '${TEST_DOCUMENTATION}': '', '${TEST_NAME}': 'Get NS Id', '${True}': True, '${username}': 'ubuntu', '${vdu_volumes_name}': 'several_volumes-VM', '${vim_timeout_multiplier}': '1.0', '${vnfd_charm_name}': 'native_manual_scale_charm-vnf', '${vnfd_charm_pkg}': 'charm-packages/native_manual_scale_charm_vnf', '${vnfd_volumes_name}': 'several_volumes-vnf', '${vnfd_volumes_pkg}': 'several_volumes_vnf', '${vnf_scale_pol_time}': '15sec', '${vnf_several_index}': 'several_volumes_vnf', '&{OPTIONS}': {'include': ['daily'], 'exclude': [], 'skip': [], 'skip_on_failure': []}, '&{SUITE_METADATA}': <robot.utils.normalizing.NormalizedDict object at 0x7fa2e974de80>, '@{TEST_TAGS}': ['cleanup', 'cluster_heal', 'daily', 'heal_01'], '@{vim_vdus}': [], '@{vim_volumes}': []}"' failed: SyntaxError: invalid syntax (<string>, line 1)
------------------------------------------------------------------------------
Get VIM Objects                                                       | FAIL |
msg=NS is not available
------------------------------------------------------------------------------
Get Volume VNF Info                                                   | FAIL |
msg=NS is not available
------------------------------------------------------------------------------
Get Volumes Info                                                      | FAIL |
Variable '${vdu_volumes_id}' not found.
------------------------------------------------------------------------------
Check VDU Disks                                                       | FAIL |
msg=VNF is not available
------------------------------------------------------------------------------
Delete Persistent Volume VDU                                          | FAIL |
msg=VDU is not available
------------------------------------------------------------------------------
Heal Persistent Volume VDU                                            | FAIL |
msg=VNF is not available
------------------------------------------------------------------------------
Check VNF After Healing                                               | FAIL |
msg=VNF is not available
------------------------------------------------------------------------------
Update VIM Objects                                                    | FAIL |
msg=NS is not available
------------------------------------------------------------------------------
Delete NS Instance                                                    | PASS |
------------------------------------------------------------------------------
Delete NS Descriptor                                                  | PASS |
------------------------------------------------------------------------------
Delete VNF Descriptors                                                | PASS |
------------------------------------------------------------------------------
Delete Objects in VIM                                                 | PASS |
------------------------------------------------------------------------------
Testsuite.Heal 01-Volume Vdu Healing :: [HEAL-01] Healing of a mul... | FAIL |
16 tests, 6 passed, 10 failed
==============================================================================
Testsuite.Heal 02-Scale Vdu Healing :: [HEAL-02] Healing of scaled charm VDUs 
==============================================================================
Create VNF Descriptors                                                | PASS |
------------------------------------------------------------------------------
Create NS Descriptor                                                  | PASS |
------------------------------------------------------------------------------
Network Service Instance Test                                         | FAIL |
Keyword 'Check For NS Instance To Configured' failed after retrying for 5 minutes. The last error was: '+------------------+--------------------------------------+---------------------+----------+------------------------------------------------------+---------------+
| ns instance name | id                                   | date                | ns state | current operation                                    | error details |
+------------------+--------------------------------------+---------------------+----------+------------------------------------------------------+---------------+
| heal_02          | 8bd90b50-69fd-4121-8f65-35eaf069a9bf | 2024-02-22T03:42:34 | BUILDING | INSTANTIATING (5f5ded18-8748-4218-be76-8f1d15cf6b01) | N/A           |
+------------------+--------------------------------------+---------------------+----------+------------------------------------------------------+---------------+
To get the history of all operations over a NS, run "osm ns-op-list NS_ID"
For more details on the current operation, run "osm ns-op-show OPERATION_ID"' does not contain any of 'READY' or 'BROKEN'
------------------------------------------------------------------------------
Get NS Id                                                             | FAIL |
Evaluating IF condition failed: Evaluating expression 'not "${ns_id}" in "{'${/}': '/', '${:}': ':', '${\\n}': '\n', '${DEBUG_FILE}': 'NONE', '${delete_max_wait_time}': '1min', '${delete_pol_time}': '15sec', '${EXECDIR}': '/robot-systest', '${failure_return_code}': '1', '${False}': False, '${healing_pol_time}': '15sec', '${LOG_FILE}': '/robot-systest/reports/log.html', '${LOG_LEVEL}': 'INFO', '${None}': None, '${ns_action_max_wait_time}': '1min', '${ns_action_pol_time}': '15sec', '${ns_config}': '{vld: [ {name: mgmtnet, vim-network-name: osm-ext} ] }', '${ns_delete_pol_time}': '15sec', '${nsd_name}': 'volumes_nativecharm-ns', '${nsd_pkg}': 'volumes_nativecharm_ns', '${ns_launch_pol_time}': '30sec', '${ns_name}': 'heal_02', '${null}': None, '${OUTPUT_DIR}': '/robot-systest/reports', '${OUTPUT_FILE}': '/robot-systest/reports/output.xml', '${password}': '', '${PREV_TEST_MESSAGE}': 'Keyword \'Check For NS Instance To Configured\' failed after retrying for 5 minutes. The last error was: \'+------------------+--------------------------------------+---------------------+----------+------------------------------------------------------+---------------+\n| ns instance name | id                                   | date                | ns state | current operation                                    | error details |\n+------------------+--------------------------------------+---------------------+----------+------------------------------------------------------+---------------+\n| heal_02          | 8bd90b50-69fd-4121-8f65-35eaf069a9bf | 202...
    [ Message content over the limit has been removed. ]
...NAME}': 'Network Service Instance Test', '${PREV_TEST_STATUS}': 'FAIL', '${privatekey}': '/root/.ssh/id_rsa', '${publickey}': '/root/.ssh/id_rsa.pub', '${REPORT_FILE}': '/robot-systest/reports/report.html', '${scale_wait_time}': '4min', '${SPACE}': ' ', '${success_return_code}': '0', '${SUITE_DOCUMENTATION}': '[HEAL-02] Healing of scaled charm VDUs', '${SUITE_NAME}': 'Testsuite.Heal 02-Scale Vdu Healing', '${SUITE_SOURCE}': '/robot-systest/testsuite/heal_02-scale_vdu_healing.robot', '${TEMPDIR}': '/tmp', '${TEST_DOCUMENTATION}': '', '${TEST_NAME}': 'Get NS Id', '${True}': True, '${username}': 'ubuntu', '${vdu_charm_name}': 'mgmtVM', '${vdu_volumes_name}': 'several_volumes-VM', '${vim_timeout_multiplier}': '1.0', '${vnf_charm_cloudinit_file}': '/root/helloworld.txt', '${vnf_charm_day1_file}': '/home/ubuntu/first-touch', '${vnf_charm_index}': 'charm_vnf', '${vnf_charm_scaling_group}': 'manual-scaling_mgmtVM', '${vnfd_charm_name}': 'native_manual_scale_charm-vnf', '${vnfd_charm_pkg}': 'charm-packages/native_manual_scale_charm_vnf', '${vnfd_volumes_name}': 'several_volumes-vnf', '${vnfd_volumes_pkg}': 'several_volumes_vnf', '${vnf_scale_pol_time}': '15sec', '${vnf_several_index}': 'several_volumes_vnf', '&{OPTIONS}': {'include': ['daily'], 'exclude': [], 'skip': [], 'skip_on_failure': []}, '&{SUITE_METADATA}': <robot.utils.normalizing.NormalizedDict object at 0x7fa2e959bdc0>, '@{TEST_TAGS}': ['cleanup', 'cluster_heal', 'daily', 'heal_02'], '@{vim_vdus}': [], '@{vim_volumes}': []}"' failed: SyntaxError: invalid syntax (<string>, line 1)
------------------------------------------------------------------------------
Scale Out Charm VNF                                                   | FAIL |
Variable '${ns_id}' not found.
------------------------------------------------------------------------------
Get VIM Objects                                                       | FAIL |
msg=NS is not available
------------------------------------------------------------------------------
Get Charm VNF Info                                                    | FAIL |
msg=NS is not available
------------------------------------------------------------------------------
Halt Charm VDU                                                        | FAIL |
msg=VDU is not available
------------------------------------------------------------------------------
Heal Charm VDU                                                        | FAIL |
msg=VNF is not available
------------------------------------------------------------------------------
Check VNF After Healing                                               | FAIL |
msg=VNF is not available
------------------------------------------------------------------------------
Update VIM Objects                                                    | FAIL |
msg=NS is not available
------------------------------------------------------------------------------
Delete NS Instance                                                    | PASS |
------------------------------------------------------------------------------
Delete NS Descriptor                                                  | PASS |
------------------------------------------------------------------------------
Delete VNF Descriptors                                                | PASS |
------------------------------------------------------------------------------
Delete Objects in VIM                                                 | PASS |
------------------------------------------------------------------------------
Testsuite.Heal 02-Scale Vdu Healing :: [HEAL-02] Healing of scaled... | FAIL |
15 tests, 6 passed, 9 failed
==============================================================================
Testsuite.Heal 03-Multiple Healing :: [HEAL-03] Healing of multiple VDUs      
==============================================================================
Create VNF Descriptors                                                | PASS |
------------------------------------------------------------------------------
Create NS Descriptor                                                  | PASS |
------------------------------------------------------------------------------
Network Service Instance Test                                         | FAIL |
Keyword 'Check For NS Instance To Configured' failed after retrying for 5 minutes. The last error was: '+------------------+--------------------------------------+---------------------+----------+------------------------------------------------------+---------------+
| ns instance name | id                                   | date                | ns state | current operation                                    | error details |
+------------------+--------------------------------------+---------------------+----------+------------------------------------------------------+---------------+
| heal_03          | 0c3f021f-a615-4c7e-af3c-71fdf26598d0 | 2024-02-22T03:49:16 | BUILDING | INSTANTIATING (3cb82748-70b2-4bde-af1a-2d825b5a98ec) | N/A           |
+------------------+--------------------------------------+---------------------+----------+------------------------------------------------------+---------------+
To get the history of all operations over a NS, run "osm ns-op-list NS_ID"
For more details on the current operation, run "osm ns-op-show OPERATION_ID"' does not contain any of 'READY' or 'BROKEN'
------------------------------------------------------------------------------
Get NS Id                                                             | FAIL |
Evaluating IF condition failed: Evaluating expression 'not "${ns_id}" in "{'${/}': '/', '${:}': ':', '${\\n}': '\n', '${DEBUG_FILE}': 'NONE', '${delete_max_wait_time}': '1min', '${delete_pol_time}': '15sec', '${EXECDIR}': '/robot-systest', '${failure_return_code}': '1', '${False}': False, '${healing_pol_time}': '15sec', '${LOG_FILE}': '/robot-systest/reports/log.html', '${LOG_LEVEL}': 'INFO', '${None}': None, '${ns_action_max_wait_time}': '1min', '${ns_action_pol_time}': '15sec', '${ns_config}': '{vld: [ {name: mgmtnet, vim-network-name: osm-ext} ] }', '${ns_delete_pol_time}': '15sec', '${nsd_name}': 'volumes_nativecharm-ns', '${nsd_pkg}': 'volumes_nativecharm_ns', '${ns_launch_pol_time}': '30sec', '${ns_name}': 'heal_03', '${null}': None, '${OUTPUT_DIR}': '/robot-systest/reports', '${OUTPUT_FILE}': '/robot-systest/reports/output.xml', '${password}': '', '${PREV_TEST_MESSAGE}': 'Keyword \'Check For NS Instance To Configured\' failed after retrying for 5 minutes. The last error was: \'+------------------+--------------------------------------+---------------------+----------+------------------------------------------------------+---------------+\n| ns instance name | id                                   | date                | ns state | current operation                                    | error details |\n+------------------+--------------------------------------+---------------------+----------+------------------------------------------------------+---------------+\n| heal_03          | 0c3f021f-a615-4c7e-af3c-71fdf26598d0 | 202...
    [ Message content over the limit has been removed. ]
..._TEST_NAME}': 'Network Service Instance Test', '${PREV_TEST_STATUS}': 'FAIL', '${privatekey}': '/root/.ssh/id_rsa', '${publickey}': '/root/.ssh/id_rsa.pub', '${REPORT_FILE}': '/robot-systest/reports/report.html', '${scale_wait_time}': '4min', '${SPACE}': ' ', '${success_return_code}': '0', '${SUITE_DOCUMENTATION}': '[HEAL-03] Healing of multiple VDUs', '${SUITE_NAME}': 'Testsuite.Heal 03-Multiple Healing', '${SUITE_SOURCE}': '/robot-systest/testsuite/heal_03-multiple_healing.robot', '${TEMPDIR}': '/tmp', '${TEST_DOCUMENTATION}': '', '${TEST_NAME}': 'Get NS Id', '${True}': True, '${username}': 'ubuntu', '${vdu_charm_name}': 'mgmtVM', '${vdu_volumes_name}': 'several_volumes-VM', '${vim_timeout_multiplier}': '1.0', '${vnf_charm_cloudinit_file}': '/root/helloworld.txt', '${vnf_charm_day1_file}': '/home/ubuntu/first-touch', '${vnf_charm_index}': 'charm_vnf', '${vnf_charm_scaling_group}': 'manual-scaling_mgmtVM', '${vnfd_charm_name}': 'native_manual_scale_charm-vnf', '${vnfd_charm_pkg}': 'charm-packages/native_manual_scale_charm_vnf', '${vnfd_volumes_name}': 'several_volumes-vnf', '${vnfd_volumes_pkg}': 'several_volumes_vnf', '${vnf_scale_pol_time}': '15sec', '${vnf_several_index}': 'several_volumes_vnf', '&{OPTIONS}': {'include': ['daily'], 'exclude': [], 'skip': [], 'skip_on_failure': []}, '&{SUITE_METADATA}': <robot.utils.normalizing.NormalizedDict object at 0x7fa2e956b460>, '@{TEST_TAGS}': ['cleanup', 'cluster_heal', 'daily', 'heal_03'], '@{vim_vdus}': [], '@{vim_volumes}': []}"' failed: SyntaxError: invalid syntax (<string>, line 1)
------------------------------------------------------------------------------
Scale Out Charm VNF                                                   | FAIL |
Variable '${ns_id}' not found.
------------------------------------------------------------------------------
Get VIM Objects                                                       | FAIL |
msg=NS is not available
------------------------------------------------------------------------------
Get Charm VNF Info                                                    | FAIL |
msg=NS is not available
------------------------------------------------------------------------------
Get Volume VNF Info                                                   | FAIL |
msg=NS is not available
------------------------------------------------------------------------------
Stop VDUs                                                             | FAIL |
msg=Charm VDUs are not available
------------------------------------------------------------------------------
Heal VDUs                                                             | FAIL |
msg=Charm VNF is not available
------------------------------------------------------------------------------
Check VNFs After Healing                                              | FAIL |
msg=Charm VNF is not available
------------------------------------------------------------------------------
Update VIM Objects                                                    | FAIL |
msg=NS is not available
------------------------------------------------------------------------------
Delete NS Instance                                                    | PASS |
------------------------------------------------------------------------------
Delete NS Descriptor                                                  | PASS |
------------------------------------------------------------------------------
Delete VNF Descriptors                                                | PASS |
------------------------------------------------------------------------------
Delete Objects in VIM                                                 | PASS |
------------------------------------------------------------------------------
Testsuite.Heal 03-Multiple Healing :: [HEAL-03] Healing of multipl... | FAIL |
16 tests, 6 passed, 10 failed
==============================================================================
Testsuite.Heal 04-Autohealing :: [HEAL-04] Autohealing of NS                  
==============================================================================
Create VNF Descriptors                                                | PASS |
------------------------------------------------------------------------------
Create NS Descriptor                                                  | PASS |
------------------------------------------------------------------------------
Network Service Instance Test                                         | PASS |
------------------------------------------------------------------------------
Get NS Id                                                             | PASS |
------------------------------------------------------------------------------
Get VIM Objects                                                       | PASS |
------------------------------------------------------------------------------
Get VNF Info                                                          | PASS |
------------------------------------------------------------------------------
Stop Autoheal VDU                                                     | PASS |
------------------------------------------------------------------------------
Wait For Autohealing To Be Completed                                  | PASS |
------------------------------------------------------------------------------
Check VNF After Healing                                               | PASS |
------------------------------------------------------------------------------
Update VIM Objects                                                    | PASS |
------------------------------------------------------------------------------
Delete NS Instance                                                    | PASS |
------------------------------------------------------------------------------
Delete NS Descriptor                                                  | PASS |
------------------------------------------------------------------------------
Delete VNF Descriptors                                                | PASS |
------------------------------------------------------------------------------
Delete Objects in VIM                                                 | PASS |
------------------------------------------------------------------------------
Testsuite.Heal 04-Autohealing :: [HEAL-04] Autohealing of NS          | PASS |
14 tests, 14 passed, 0 failed
==============================================================================
Testsuite.K8S 02-K8Scluster Creation :: [K8s-02] K8s cluster addition.        
==============================================================================
Add K8s Cluster To OSM                                                | PASS |
------------------------------------------------------------------------------
Remove K8s Cluster from OSM                                           | PASS |
------------------------------------------------------------------------------
Testsuite.K8S 02-K8Scluster Creation :: [K8s-02] K8s cluster addit... | PASS |
2 tests, 2 passed, 0 failed
==============================================================================
Testsuite.K8S 03-Simple K8S :: [K8s-03] Simple K8s.                           
==============================================================================
Create Simple K8s VNF Descriptor                                      | PASS |
------------------------------------------------------------------------------
Create Simple K8s Descriptor                                          | PASS |
------------------------------------------------------------------------------
Add K8s Cluster To OSM                                                | PASS |
------------------------------------------------------------------------------
Network Service K8s Instance Test                                     | PASS |
------------------------------------------------------------------------------
Execute Day 2 Operations :: Performs one Day 2 operation per VNF t... | PASS |
------------------------------------------------------------------------------
Delete NS K8s Instance Test                                           | PASS |
------------------------------------------------------------------------------
Remove K8s Cluster from OSM                                           | PASS |
------------------------------------------------------------------------------
Delete NS Descriptor Test                                             | PASS |
------------------------------------------------------------------------------
Delete VNF Descriptor Test                                            | PASS |
------------------------------------------------------------------------------
Delete VNF NS Packages                                                | PASS |
------------------------------------------------------------------------------
Testsuite.K8S 03-Simple K8S :: [K8s-03] Simple K8s.                   | PASS |
10 tests, 10 passed, 0 failed
==============================================================================
Testsuite.K8S 04-Openldap Helm :: [K8s-04] Openldap Helm chart.               
==============================================================================
Create Package For OpenLDAP CNF                                       | PASS |
------------------------------------------------------------------------------
Create Package For OpenLDAP NS                                        | PASS |
------------------------------------------------------------------------------
Add K8s Cluster To OSM                                                | PASS |
------------------------------------------------------------------------------
Create Network Service Instance                                       | PASS |
------------------------------------------------------------------------------
Get Ns Id                                                             | PASS |
------------------------------------------------------------------------------
Get Vnf Id                                                            | PASS |
------------------------------------------------------------------------------
Execute Upgrade Operation                                             | PASS |
------------------------------------------------------------------------------
Check Replicas After Upgrade Operation                                | PASS |
------------------------------------------------------------------------------
Execute Rollback Operation                                            | PASS |
------------------------------------------------------------------------------
Check Replicas After Rollback Operation                               | PASS |
------------------------------------------------------------------------------
Delete Network Service Instance                                       | PASS |
------------------------------------------------------------------------------
Remove K8s Cluster from OSM                                           | PASS |
------------------------------------------------------------------------------
Delete NS Descriptor Test                                             | PASS |
------------------------------------------------------------------------------
Delete VNF Descriptor Test                                            | PASS |
------------------------------------------------------------------------------
Testsuite.K8S 04-Openldap Helm :: [K8s-04] Openldap Helm chart.       | PASS |
14 tests, 14 passed, 0 failed
==============================================================================
Testsuite.K8S 05-K8S Proxy Charms :: [K8s-05] K8s Proxy Charm.                
==============================================================================
Create Charm VNF Descriptor                                           | PASS |
------------------------------------------------------------------------------
Create Charm NS Descriptor                                            | PASS |
------------------------------------------------------------------------------
Instantiate Charm Network Service                                     | FAIL |
'+------------------------+--------------------------------------+---------------------+----------+-------------------+------------------------------------------+
| ns instance name       | id                                   | date                | ns state | current operation | error details                            |
+------------------------+--------------------------------------+---------------------+----------+-------------------+------------------------------------------+
| k8s_05-k8s_proxy_charm | 87c4cf8b-e2f9-4679-abb4-d379f9b1ff50 | 2024-02-22T04:10:53 | BROKEN   | IDLE (None)       | Operation: INSTANTIATING.dcee24c7-066d-4 |
|                        |                                      |                     |          |                   | 264-9a9c-c800916bebed, Stage 2/5:        |
|                        |                                      |                     |          |                   | deployment of KDUs, VMs and execution    |
|                        |                                      |                     |          |                   | environments.                     ...
    [ Message content over the limit has been removed. ]
...                 |                                      |                     |          |                   | sdLifzD7ShwaveqX01b+i2KCsNXIalDECFEDJROR |
|                        |                                      |                     |          |                   | OuplDwravOri4FAL6axL5Q== root@app-       |
|                        |                                      |                     |          |                   | vnf-d568dc1ab3-z0-eqabt-operator-0       |
|                        |                                      |                     |          |                   |  Cannot inject ssh-key because target    |
|                        |                                      |                     |          |                   | VNF is in error state                    |
+------------------------+--------------------------------------+---------------------+----------+-------------------+------------------------------------------+
To get the history of all operations over a NS, run "osm ns-op-list NS_ID"
For more details on the current operation, run "osm ns-op-show OPERATION_ID"' contains 'BROKEN'
------------------------------------------------------------------------------
Get Management Ip Addresses                                           | FAIL |
Variable '${ns_id}' not found.
------------------------------------------------------------------------------
Test SSH Access                                                       | FAIL |
msg=IP address of the management VNF 'vnf1' is not available
------------------------------------------------------------------------------
Check Remote Files Created Via Day 1 Operations :: The Charm VNF h... | FAIL |
Variable '${vnf_1_ip_addr}' not found.
------------------------------------------------------------------------------
Execute Day 2 Operations :: Performs one Day 2 operation per VNF t... | FAIL |
msg=Network service instance is not available
------------------------------------------------------------------------------
Check Remote Files Created Via Day 2 Operations :: Check whether t... | FAIL |
Variable '${vnf_1_ip_addr}' not found.
------------------------------------------------------------------------------
Delete NS Instance                                                    | PASS |
------------------------------------------------------------------------------
Delete NS Descriptor                                                  | PASS |
------------------------------------------------------------------------------
Delete VNF Descriptor                                                 | PASS |
------------------------------------------------------------------------------
Testsuite.K8S 05-K8S Proxy Charms :: [K8s-05] K8s Proxy Charm.        | FAIL |
11 tests, 5 passed, 6 failed
==============================================================================
Testsuite.K8S 06-K8S Secure Key Management :: [K8s-06] K8s Secure Key Manag...
==============================================================================
Create Charm VNF Descriptor                                           | PASS |
------------------------------------------------------------------------------
Create Charm NS Descriptor                                            | PASS |
------------------------------------------------------------------------------
Instantiate Charm Network Service                                     | FAIL |
'+---------------------------------+--------------------------------------+---------------------+----------+-------------------+------------------------------------------+
| ns instance name                | id                                   | date                | ns state | current operation | error details                            |
+---------------------------------+--------------------------------------+---------------------+----------+-------------------+------------------------------------------+
| k8s_06-nopasswd_k8s_proxy_charm | 650305e1-a0d2-4f75-8e40-eb268f8f4143 | 2024-02-22T04:19:00 | BROKEN   | IDLE (None)       | Operation: INSTANTIATING.f6edfca6-bddf-4 |
|                                 |                                      |                     |          |                   | bac-a3a3-f2cf7467ef2f, Stage 2/5:        |
|                                 |                                      |                     |          |                   | deployment of KDUs, VMs and execution    |
|                                 |                                      |                     |          |                   | environments.            ...
    [ Message content over the limit has been removed. ]
...                 |                                      |                     |          |                   | xUlJVC9k0ZvECygHtOiNy4cevTL1LURErcaWpL/+ |
|                                 |                                      |                     |          |                   | 7gdad6Hz7OShGEgubVyfkQ== root@app-       |
|                                 |                                      |                     |          |                   | vnf-2790625d3f-z0-jwxgf-operator-0       |
|                                 |                                      |                     |          |                   |  Cannot inject ssh-key because target    |
|                                 |                                      |                     |          |                   | VNF is in error state                    |
+---------------------------------+--------------------------------------+---------------------+----------+-------------------+------------------------------------------+
To get the history of all operations over a NS, run "osm ns-op-list NS_ID"
For more details on the current operation, run "osm ns-op-show OPERATION_ID"' contains 'BROKEN'
------------------------------------------------------------------------------
Get Ns Id                                                             | PASS |
------------------------------------------------------------------------------
Get Management Ip Addresses                                           | PASS |
------------------------------------------------------------------------------
Test SSH Access                                                       | FAIL |
timeout: timed out
------------------------------------------------------------------------------
Check Remote Files Created Via Day 1 Operations :: The Charm VNF h... | FAIL |
NoValidConnectionsError: [Errno None] Unable to connect to port 22 on 172.21.248.26
------------------------------------------------------------------------------
Execute Day 2 Operations :: Performs one Day 2 operation per VNF t... | FAIL |
The ns-action with id d46663ad-f5a0-4397-b00b-ef372ba7cef8 was not completed
------------------------------------------------------------------------------
Check Remote Files Created Via Day 2 Operations :: Check whether t... | FAIL |
timeout: timed out
------------------------------------------------------------------------------
Delete NS Instance                                                    | PASS |
------------------------------------------------------------------------------
Delete NS Descriptor                                                  | PASS |
------------------------------------------------------------------------------
Delete VNF Descriptor                                                 | PASS |
------------------------------------------------------------------------------
Testsuite.K8S 06-K8S Secure Key Management :: [K8s-06] K8s Secure ... | FAIL |
12 tests, 7 passed, 5 failed
==============================================================================
Testsuite.K8S 07-Dummy Helm :: [K8s-07] Openldap Helm in isolated cluster w...
==============================================================================
Create Package For OpenLDAP CNF                                       | PASS |
------------------------------------------------------------------------------
Create Package For OpenLDAP NS                                        | PASS |
------------------------------------------------------------------------------
Create Dummy VIM                                                      | PASS |
------------------------------------------------------------------------------
Add K8s Cluster To OSM                                                | PASS |
------------------------------------------------------------------------------
Create Network Service Instance                                       | PASS |
------------------------------------------------------------------------------
Delete Network Service Instance                                       | PASS |
------------------------------------------------------------------------------
Remove K8s Cluster from OSM                                           | PASS |
------------------------------------------------------------------------------
Delete VIM                                                            | PASS |
------------------------------------------------------------------------------
Delete NS Descriptor Test                                             | PASS |
------------------------------------------------------------------------------
Delete VNF Descriptor Test                                            | PASS |
------------------------------------------------------------------------------
Testsuite.K8S 07-Dummy Helm :: [K8s-07] Openldap Helm in isolated ... | PASS |
10 tests, 10 passed, 0 failed
==============================================================================
Testsuite.K8S 08-Simple K8S Scaling :: [K8s-08] Simple K8s Scale.             
==============================================================================
Create Simple K8s Scale VNF Descriptor                                | PASS |
------------------------------------------------------------------------------
Create Simple K8s Scale NS Descriptor                                 | PASS |
------------------------------------------------------------------------------
Add K8s Cluster To OSM                                                | PASS |
------------------------------------------------------------------------------
Network Service K8s Instance Test                                     | PASS |
------------------------------------------------------------------------------
Get KDU Model Name :: Get the model name of the network service k8... | PASS |
------------------------------------------------------------------------------
Get Scale Count Before Scale Out :: Get the scale count of the app... | PASS |
------------------------------------------------------------------------------
Perform Manual KDU Scale Out :: Scale out the application of netwo... | PASS |
------------------------------------------------------------------------------
Check Scale Count After Scale Out :: Check whether the scale count... | PASS |
------------------------------------------------------------------------------
Perform Manual KDU Scale In :: Scale in the application of network... | PASS |
------------------------------------------------------------------------------
Check Scale Count After Scale In :: Check whether the scale count ... | PASS |
------------------------------------------------------------------------------
Delete NS K8s Instance Test                                           | PASS |
------------------------------------------------------------------------------
Remove K8s Cluster from OSM                                           | PASS |
------------------------------------------------------------------------------
Delete NS Descriptor Test                                             | PASS |
------------------------------------------------------------------------------
Delete VNF Descriptor Test                                            | PASS |
------------------------------------------------------------------------------
Testsuite.K8S 08-Simple K8S Scaling :: [K8s-08] Simple K8s Scale.     | PASS |
14 tests, 14 passed, 0 failed
==============================================================================
Testsuite.K8S 09-Pebble Charm K8S :: [K8s-09] Pebble Charm.                   
==============================================================================
Create Simple K8s VNF Descriptor                                      | PASS |
------------------------------------------------------------------------------
Create Simple K8s Descriptor                                          | PASS |
------------------------------------------------------------------------------
Add K8s Cluster To OSM                                                | PASS |
------------------------------------------------------------------------------
Network Service K8s Instance Test                                     | PASS |
------------------------------------------------------------------------------
Execute Day 2 Operations :: Performs one Day 2 operation per VNF t... | PASS |
------------------------------------------------------------------------------
Delete NS K8s Instance Test                                           | PASS |
------------------------------------------------------------------------------
Remove K8s Cluster from OSM                                           | PASS |
------------------------------------------------------------------------------
Delete NS Descriptor Test                                             | PASS |
------------------------------------------------------------------------------
Delete VNF Descriptor Test                                            | PASS |
------------------------------------------------------------------------------
Delete VNF NS Packages                                                | PASS |
------------------------------------------------------------------------------
Testsuite.K8S 09-Pebble Charm K8S :: [K8s-09] Pebble Charm.           | PASS |
10 tests, 10 passed, 0 failed
==============================================================================
Testsuite.K8S 10-Sol004 Sol007 With K8S Proxy Charms :: [K8s-10] K8s Proxy ...
==============================================================================
Create Charm VNF Descriptor                                           | PASS |
------------------------------------------------------------------------------
Create Charm NS Descriptor                                            | PASS |
------------------------------------------------------------------------------
Instantiate Charm Network Service                                     | FAIL |
'+------------------------+--------------------------------------+---------------------+----------+-------------------+------------------------------------------+
| ns instance name       | id                                   | date                | ns state | current operation | error details                            |
+------------------------+--------------------------------------+---------------------+----------+-------------------+------------------------------------------+
| k8s_10-k8s_proxy_charm | 71de49db-27dd-4e50-9b28-5ad104ad1aaf | 2024-02-22T04:41:39 | BROKEN   | IDLE (None)       | Operation:                               |
|                        |                                      |                     |          |                   | INSTANTIATING.2aceb909-d1f6-43ed-        |
|                        |                                      |                     |          |                   | bb8a-977dfa9c0258, Stage 2/5: deployment |
|                        |                                      |                     |          |                   | of KDUs, VMs and execution environ...
    [ Message content over the limit has been removed. ]
...                 |                                      |                     |          |                   | YGlRTiejQ08KAZo5Ys/10ERjVJusXzB6cZUriwgY |
|                        |                                      |                     |          |                   | 4zq5VZOELearS9c/v7LDoQ== root@app-       |
|                        |                                      |                     |          |                   | vnf-6379bce3cf-z0-vlo2z-operator-0       |
|                        |                                      |                     |          |                   |  Cannot inject ssh-key because target    |
|                        |                                      |                     |          |                   | VNF is in error state                    |
+------------------------+--------------------------------------+---------------------+----------+-------------------+------------------------------------------+
To get the history of all operations over a NS, run "osm ns-op-list NS_ID"
For more details on the current operation, run "osm ns-op-show OPERATION_ID"' contains 'BROKEN'
------------------------------------------------------------------------------
Get Management Ip Addresses                                           | FAIL |
Variable '${ns_id}' not found.
------------------------------------------------------------------------------
Test SSH Access                                                       | FAIL |
msg=IP address of the management VNF 'vnf1' is not available
------------------------------------------------------------------------------
Check Remote Files Created Via Day 1 Operations :: The Charm VNF h... | FAIL |
Variable '${vnf_1_ip_addr}' not found.
------------------------------------------------------------------------------
Execute Day 2 Operations :: Performs one Day 2 operation per VNF t... | FAIL |
msg=Network service instance is not available
------------------------------------------------------------------------------
Check Remote Files Created Via Day 2 Operations :: Check whether t... | FAIL |
Variable '${vnf_1_ip_addr}' not found.
------------------------------------------------------------------------------
Delete NS Instance                                                    | PASS |
------------------------------------------------------------------------------
Delete NS Descriptor                                                  | PASS |
------------------------------------------------------------------------------
Delete VNF Descriptor                                                 | PASS |
------------------------------------------------------------------------------
Testsuite.K8S 10-Sol004 Sol007 With K8S Proxy Charms :: [K8s-10] K... | FAIL |
11 tests, 5 passed, 6 failed
==============================================================================
Testsuite.K8S 12-Openldap Helm Day-2 :: [K8s-12] Openldap Helm chart.         
==============================================================================
Create Package For OpenLDAP CNF                                       | PASS |
------------------------------------------------------------------------------
Create Package For OpenLDAP NS                                        | PASS |
------------------------------------------------------------------------------
Add K8s Cluster To OSM                                                | PASS |
------------------------------------------------------------------------------
Create Network Service Instance                                       | PASS |
------------------------------------------------------------------------------
Get Ns Id                                                             | PASS |
------------------------------------------------------------------------------
Get Vnf Id                                                            | PASS |
------------------------------------------------------------------------------
Execute Day 2 Operations :: Performs one Day 2 operation.             | PASS |
------------------------------------------------------------------------------
Execute Upgrade Operation                                             | PASS |
------------------------------------------------------------------------------
Check Replicas After Upgrade Operation                                | PASS |
------------------------------------------------------------------------------
Execute Rollback Operation                                            | PASS |
------------------------------------------------------------------------------
Check Replicas After Rollback Operation                               | PASS |
------------------------------------------------------------------------------
Delete Network Service Instance                                       | PASS |
------------------------------------------------------------------------------
Remove K8s Cluster from OSM                                           | PASS |
------------------------------------------------------------------------------
Delete NS Descriptor Test                                             | PASS |
------------------------------------------------------------------------------
Delete VNF Descriptor Test                                            | PASS |
------------------------------------------------------------------------------
Testsuite.K8S 12-Openldap Helm Day-2 :: [K8s-12] Openldap Helm chart. | PASS |
15 tests, 15 passed, 0 failed
==============================================================================
Testsuite.Quotas 01-Quota Enforcement :: [QUOTAS-01] Quota enforcement.       
==============================================================================
Create First Project With Quotas                                      | PASS |
------------------------------------------------------------------------------
Create Second Project With Quotas                                     | PASS |
------------------------------------------------------------------------------
Create User In Projects                                               | PASS |
------------------------------------------------------------------------------
Change First Project Name to Third Project Name                       | PASS |
------------------------------------------------------------------------------
Create VNFDs On Third Project Until Exceed Quota                      | PASS |
------------------------------------------------------------------------------
Increase Third Project Quotas                                         | PASS |
------------------------------------------------------------------------------
Create More VNFDs On Third Project Until Exceed Quota                 | PASS |
------------------------------------------------------------------------------
Create VNFDs On Second Project Until Exceed Quota                     | PASS |
------------------------------------------------------------------------------
Check Project Scopes                                                  | PASS |
------------------------------------------------------------------------------
Delete Second Project VNFD                                            | PASS |
------------------------------------------------------------------------------
Delete Third Project VNFDs                                            | PASS |
------------------------------------------------------------------------------
Delete Second Project After Removing User From It                     | PASS |
------------------------------------------------------------------------------
Delete Projects User                                                  | PASS |
------------------------------------------------------------------------------
Delete Third Project                                                  | PASS |
------------------------------------------------------------------------------
Testsuite.Quotas 01-Quota Enforcement :: [QUOTAS-01] Quota enforce... | PASS |
14 tests, 14 passed, 0 failed
==============================================================================
Testsuite.Sa 01-Vnf With Vim Metrics :: [SA-01] VNF with VIM-based metrics.   
==============================================================================
Create VNF Descriptor                                                 | PASS |
------------------------------------------------------------------------------
Create NS Descriptor                                                  | PASS |
------------------------------------------------------------------------------
Instantiate Network Service                                           | PASS |
------------------------------------------------------------------------------
Get VNF VIM-based Metrics                                             | PASS |
------------------------------------------------------------------------------
Delete NS Instance                                                    | PASS |
------------------------------------------------------------------------------
Delete NS Descriptor                                                  | PASS |
------------------------------------------------------------------------------
Delete VNF Descriptor                                                 | PASS |
------------------------------------------------------------------------------
Testsuite.Sa 01-Vnf With Vim Metrics :: [SA-01] VNF with VIM-based... | PASS |
7 tests, 7 passed, 0 failed
==============================================================================
Testsuite.Sa 02-Vnf With Vim Metrics And Autoscaling :: [SA-02] VNF with VI...
==============================================================================
Create VNF Descriptor                                                 | PASS |
------------------------------------------------------------------------------
Get Scale-Out Threshold From VNF                                      | PASS |
------------------------------------------------------------------------------
Create NS Descriptor                                                  | PASS |
------------------------------------------------------------------------------
Instantiate Network Service                                           | PASS |
------------------------------------------------------------------------------
Get VNF Id                                                            | PASS |
------------------------------------------------------------------------------
Get VNF IP Address                                                    | PASS |
------------------------------------------------------------------------------
Get VNF VIM-based Metric Before Auto-scaling                          | PASS |
------------------------------------------------------------------------------
Increase VIM-based Metric To Force Auto-scaling                       | PASS |
------------------------------------------------------------------------------
Wait VIM-based Metric To Exceed Threshold                             | PASS |
------------------------------------------------------------------------------
Get VDUs After Auto-scaling                                           | PASS |
------------------------------------------------------------------------------
Delete NS Instance                                                    | PASS |
------------------------------------------------------------------------------
Delete NS Descriptor                                                  | PASS |
------------------------------------------------------------------------------
Delete VNF Descriptor                                                 | PASS |
------------------------------------------------------------------------------
Testsuite.Sa 02-Vnf With Vim Metrics And Autoscaling :: [SA-02] VN... | PASS |
13 tests, 13 passed, 0 failed
==============================================================================
Testsuite.Sa 07-Alarms From Sa-Related Vnfs :: [SA-07] Events or alarms com...
==============================================================================
Create Webhook Service VNF Descriptor                                 | PASS |
------------------------------------------------------------------------------
Create Webhook Service NS Descriptor                                  | PASS |
------------------------------------------------------------------------------
Instantiate Webhook Service Network Service                           | PASS |
------------------------------------------------------------------------------
Get Webhook Service VNF IP Address                                    | PASS |
------------------------------------------------------------------------------
Start Webhook Service                                                 | PASS |
------------------------------------------------------------------------------
Create VNF Descriptor                                                 | PASS |
------------------------------------------------------------------------------
Create NS Descriptor                                                  | PASS |
------------------------------------------------------------------------------
Instantiate Network Service                                           | PASS |
------------------------------------------------------------------------------
Get Alarm Metric                                                      | PASS |
------------------------------------------------------------------------------
Check Alarms Were Received                                            | PASS |
------------------------------------------------------------------------------
Delete NS Instance                                                    | PASS |
------------------------------------------------------------------------------
Delete NS Descriptor                                                  | PASS |
------------------------------------------------------------------------------
Delete VNF Descriptor                                                 | PASS |
------------------------------------------------------------------------------
Delete Webhook Service NS Instance                                    | PASS |
------------------------------------------------------------------------------
Delete Webhook Service NS Descriptor                                  | PASS |
------------------------------------------------------------------------------
Delete Webhook Service VNF Descriptor                                 | PASS |
------------------------------------------------------------------------------
Testsuite.Sa 07-Alarms From Sa-Related Vnfs :: [SA-07] Events or a... | PASS |
16 tests, 16 passed, 0 failed
==============================================================================
Testsuite.Sa 08-Vnf With Vnf Indicators Snmp :: [SA-08] VNF with VNF-based ...
==============================================================================
Create VNF Descriptor                                                 | PASS |
------------------------------------------------------------------------------
Create NS Descriptor                                                  | PASS |
------------------------------------------------------------------------------
Instantiate Network Service                                           | FAIL |
Keyword 'Check For NS Instance To Configured' failed after retrying for 5 minutes. The last error was: '+-----------------------------------------+--------------------------------------+---------------------+----------+------------------------------------------------------+---------------+
| ns instance name                        | id                                   | date                | ns state | current operation                                    | error details |
+-----------------------------------------+--------------------------------------+---------------------+----------+------------------------------------------------------+---------------+
| sa_08-vnf_with_vnf_indicators_snmp_test | 90b4552a-ef49-4c88-98db-e831ec2c9ce8 | 2024-02-22T05:16:31 | BUILDING | INSTANTIATING (937afc96-ce88-4e99-8654-d99d265530c0) | N/A           |
+-----------------------------------------+--------------------------------------+---------------------+----------+------------------------------------------------------+---------------+
To get the history of all operations over a NS, run "osm ns-op-list NS_ID"
For more details on the current operation, run "osm ns-op-show OPERATION_ID"' does not contain any of 'READY' or 'BROKEN'
------------------------------------------------------------------------------
Get VNF SNMP Metrics                                                  | FAIL |
Keyword 'Get Metric' failed after retrying 10 times. The last error was: Metric ifInOctets not found
------------------------------------------------------------------------------
Delete NS Instance                                                    | PASS |
------------------------------------------------------------------------------
Delete NS Descriptor                                                  | PASS |
------------------------------------------------------------------------------
Delete VNF Descriptor                                                 | PASS |
------------------------------------------------------------------------------
Testsuite.Sa 08-Vnf With Vnf Indicators Snmp :: [SA-08] VNF with V... | FAIL |
7 tests, 5 passed, 2 failed
==============================================================================
Testsuite.Slice 01-Network Slicing :: [SLICE-01] Network Slicing.             
==============================================================================
Create Slice VNF Descriptors :: Onboards all the VNFDs required fo... | PASS |
------------------------------------------------------------------------------
Create Slice NS Descriptors :: Onboards all the NSDs required for ... | PASS |
------------------------------------------------------------------------------
Create Slice Template :: Onboards the Network Slice Template: nst ... | PASS |
------------------------------------------------------------------------------
Network Slice Instance Test :: Instantiates the NST recently onboa... | FAIL |
'+------------------------+--------------------------------------+--------------------+---------------+---------------------------------------------------------------------------------------------------------------------------------------------------------------------------------------------------------------------+
| netslice instance name | id                                   | operational status | config status | detailed status                                                                                                                                                                                                     |
+------------------------+--------------------------------------+--------------------+---------------+---------------------------------------------------------------------------------------------------------------------------------------------------------------------------------------------------------------------+
| slicebasic             | d2d65b5f-ed08-4eec-a402-799c0ab504dc | failed             | configured    | ERROR instantiating: NS f76ea280-4fc5-4528-b592-78dc92320df9 FAILED: Deploying at VIM: Error at create vdu: unknown; NS 302bc37e-38f0-464f-b186-6275f85db7f5 FAILED: Deploying at VIM: Error at create vdu: unknown |
+------------------------+--------------------------------------+--------------------+---------------+---------------------------------------------------------------------------------------------------------------------------------------------------------------------------------------------------------------------+' contains 'failed'
------------------------------------------------------------------------------
Get Middle Vnf Management Ip :: Obtains the management IP of the s... | PASS |
------------------------------------------------------------------------------
Get Slice Vnf Ip Addresses :: Obtains the list of IPs addresses in... | PASS |
------------------------------------------------------------------------------
Test Middle Ns Ping :: Pings the slice middle vnf (mgmt_vnf_ip)       | FAIL |
Keyword 'Test Ping Host' failed after retrying for 30 seconds. The last error was: 1 != 0
------------------------------------------------------------------------------
Test Middle Vnf SSH Access :: SSH access to the slice middle vnf (... | FAIL |
timeout: timed out
------------------------------------------------------------------------------
Test Slice Connectivity :: SSH access to the slice middle vnf (mgm... | FAIL |
NoValidConnectionsError: [Errno None] Unable to connect to port 22 on 172.21.249.51
------------------------------------------------------------------------------
Delete Slice Instance :: Stops the slice instance (slice_name)        | PASS |
------------------------------------------------------------------------------
Delete Slice Template :: Deletes the NST (nst_name) from OSM          | PASS |
------------------------------------------------------------------------------
Delete NS Descriptors :: Deletes all the NSDs created for the test... | PASS |
------------------------------------------------------------------------------
Delete VNF Descriptors :: Deletes all the VNFDs created for the te... | PASS |
------------------------------------------------------------------------------
Testsuite.Slice 01-Network Slicing :: [SLICE-01] Network Slicing.     | FAIL |
13 tests, 9 passed, 4 failed
==============================================================================
Testsuite.Slice 02-Shared Network Slicing :: [SLICE-02] Shared Network Slic...
==============================================================================
Create Slice VNF Descriptors :: Onboards all the VNFDs required fo... | PASS |
------------------------------------------------------------------------------
Create Slice NS Descriptors :: Onboards all the NSDs required for ... | PASS |
------------------------------------------------------------------------------
Create Slice Templates :: Onboards the Network Slice Templates: ns... | PASS |
------------------------------------------------------------------------------
Network Slice First Instance :: Instantiates the First NST recentl... | FAIL |
'+------------------------+--------------------------------------+--------------------+---------------+---------------------------------------------------------------------------------------------------------------------------------------------------------------------------------------------------------------------+
| netslice instance name | id                                   | operational status | config status | detailed status                                                                                                                                                                                                     |
+------------------------+--------------------------------------+--------------------+---------------+---------------------------------------------------------------------------------------------------------------------------------------------------------------------------------------------------------------------+
| slicebasic             | 45bc5c61-6028-4bbd-bc6e-e0d7157181e1 | failed             | configured    | ERROR instantiating: NS 88f74e29-7691-48f6-843b-3b4ca253b46f FAILED: Deploying at VIM: Error at create vdu: unknown; NS 7be1a2e1-f421-404f-933b-c99ca2ea215d FAILED: Deploying at VIM: Error at create vdu: unknown |
+------------------------+--------------------------------------+--------------------+---------------+---------------------------------------------------------------------------------------------------------------------------------------------------------------------------------------------------------------------+' contains 'failed'
------------------------------------------------------------------------------
Network Slice Second Instance :: Instantiates the Second NST recen... | FAIL |
'+------------------------+--------------------------------------+--------------------+---------------+---------------------------------------------------------------------------------------------------------------------------------------------------------------------------------------------------------------------+
| netslice instance name | id                                   | operational status | config status | detailed status                                                                                                                                                                                                     |
+------------------------+--------------------------------------+--------------------+---------------+---------------------------------------------------------------------------------------------------------------------------------------------------------------------------------------------------------------------+
| sliceshared            | fed028e5-1c97-46a7-995e-2bd166d85be0 | failed             | configured    | ERROR instantiating: NS 88f74e29-7691-48f6-843b-3b4ca253b46f FAILED: Deploying at VIM: Error at create vdu: unknown; NS 42ec754f-1b68-4d01-82c3-8e2ce958c3f0 FAILED: Deploying at VIM: Error at create vdu: unknown |
+------------------------+--------------------------------------+--------------------+---------------+---------------------------------------------------------------------------------------------------------------------------------------------------------------------------------------------------------------------+' contains 'failed'
------------------------------------------------------------------------------
First Network Slice Ns Count :: Counts the NS in both slice instan... | PASS |
------------------------------------------------------------------------------
Get Middle Vnf Management Ip :: Obtains the management IP of the s... | PASS |
------------------------------------------------------------------------------
Get First Slice Vnf IPs :: Obtains the list of IPs addresses in th... | PASS |
------------------------------------------------------------------------------
Test Middle Ns Ping :: Pings the slice middle vnf (mgmt_vnf_ip)       | FAIL |
Keyword 'Test Ping Host' failed after retrying for 30 seconds. The last error was: 1 != 0
------------------------------------------------------------------------------
Test Middle Vnf SSH Access :: SSH access to the slice middle vnf (... | FAIL |
timeout: timed out
------------------------------------------------------------------------------
Test First Slice Connectivity :: SSH access to the slice middle vn... | FAIL |
NoValidConnectionsError: [Errno None] Unable to connect to port 22 on 172.21.249.135
------------------------------------------------------------------------------
Delete Slice One Instance :: Stops the slice instance (slice_name)    | PASS |
------------------------------------------------------------------------------
Second Network Slice Ns Count :: Counts the NS in both slice insta... | PASS |
------------------------------------------------------------------------------
Get Second Slice Vnf IPs :: Obtains the list of IPs addresses in t... | PASS |
------------------------------------------------------------------------------
Test Second Slice Connectivity :: SSH access to the slice middle v... | FAIL |
timeout: timed out
------------------------------------------------------------------------------
Delete Slice Two Instance :: Stops the slice instance (slice2_name)   | PASS |
------------------------------------------------------------------------------
Delete Slice One Template :: Deletes the NST (nst_name) from OSM      | PASS |
------------------------------------------------------------------------------
Delete Slice Two Template :: Deletes the NST (nst2_name) from OSM     | PASS |
------------------------------------------------------------------------------
Delete NS Descriptors :: Deletes all the NSDs created for the test... | PASS |
------------------------------------------------------------------------------
Delete VNF Descriptors :: Deletes all the VNFDs created for the te... | PASS |
------------------------------------------------------------------------------
Testsuite.Slice 02-Shared Network Slicing :: [SLICE-02] Shared Net... | FAIL |
20 tests, 14 passed, 6 failed
==============================================================================
Testsuite.Sol003 01-Vnf-Lifecycle-Management :: [SOL003-01] Sol003 Api testing
==============================================================================
Create VNF package from JSON file descriptor :: Test case to creat... | PASS |
------------------------------------------------------------------------------
Instantiate VNF :: Test case to Instantiate a VNF                     | PASS |
------------------------------------------------------------------------------
Query VNF Instances :: Test case to query VNF Instance                | PASS |
------------------------------------------------------------------------------
Query VNF Instance ID :: Test case to query Vnf instance ID           | PASS |
------------------------------------------------------------------------------
Query VNF LCM Ops :: Test case to Query VNF LCM operation             | PASS |
------------------------------------------------------------------------------
Query VNF LCM Ops ID                                                  | PASS |
------------------------------------------------------------------------------
Scale VNF :: Test case to Scale out VNF                               | PASS |
------------------------------------------------------------------------------
Terminate VNF :: Test case to terminate the VNF                       /usr/local/lib/python3.8/dist-packages/urllib3/connectionpool.py:1043: InsecureRequestWarning: Unverified HTTPS request is being made to host '172.21.249.142'. Adding certificate verification is strongly advised. See: https://urllib3.readthedocs.io/en/1.26.x/advanced-usage.html#ssl-warnings
  warnings.warn(
/usr/local/lib/python3.8/dist-packages/urllib3/connectionpool.py:1043: InsecureRequestWarning: Unverified HTTPS request is being made to host '172.21.249.142'. Adding certificate verification is strongly advised. See: https://urllib3.readthedocs.io/en/1.26.x/advanced-usage.html#ssl-warnings
  warnings.warn(
/usr/local/lib/python3.8/dist-packages/urllib3/connectionpool.py:1043: InsecureRequestWarning: Unverified HTTPS request is being made to host '172.21.249.142'. Adding certificate verification is strongly advised. See: https://urllib3.readthedocs.io/en/1.26.x/advanced-usage.html#ssl-warnings
  warnings.warn(
/usr/local/lib/python3.8/dist-packages/urllib3/connectionpool.py:1043: InsecureRequestWarning: Unverified HTTPS request is being made to host '172.21.249.142'. Adding certificate verification is strongly advised. See: https://urllib3.readthedocs.io/en/1.26.x/advanced-usage.html#ssl-warnings
  warnings.warn(
/usr/local/lib/python3.8/dist-packages/urllib3/connectionpool.py:1043: InsecureRequestWarning: Unverified HTTPS request is being made to host '172.21.249.142'. Adding certificate verification is strongly advised. See: https://urllib3.readthedocs.io/en/1.26.x/advanced-usage.html#ssl-warnings
  warnings.warn(
/usr/local/lib/python3.8/dist-packages/urllib3/connectionpool.py:1043: InsecureRequestWarning: Unverified HTTPS request is being made to host '172.21.249.142'. Adding certificate verification is strongly advised. See: https://urllib3.readthedocs.io/en/1.26.x/advanced-usage.html#ssl-warnings
  warnings.warn(
/usr/local/lib/python3.8/dist-packages/urllib3/connectionpool.py:1043: InsecureRequestWarning: Unverified HTTPS request is being made to host '172.21.249.142'. Adding certificate verification is strongly advised. See: https://urllib3.readthedocs.io/en/1.26.x/advanced-usage.html#ssl-warnings
  warnings.warn(
/usr/local/lib/python3.8/dist-packages/urllib3/connectionpool.py:1043: InsecureRequestWarning: Unverified HTTPS request is being made to host '172.21.249.142'. Adding certificate verification is strongly advised. See: https://urllib3.readthedocs.io/en/1.26.x/advanced-usage.html#ssl-warnings
  warnings.warn(
/usr/local/lib/python3.8/dist-packages/urllib3/connectionpool.py:1043: InsecureRequestWarning: Unverified HTTPS request is being made to host '172.21.249.142'. Adding certificate verification is strongly advised. See: https://urllib3.readthedocs.io/en/1.26.x/advanced-usage.html#ssl-warnings
  warnings.warn(
/usr/local/lib/python3.8/dist-packages/urllib3/connectionpool.py:1043: InsecureRequestWarning: Unverified HTTPS request is being made to host '172.21.249.142'. Adding certificate verification is strongly advised. See: https://urllib3.readthedocs.io/en/1.26.x/advanced-usage.html#ssl-warnings
  warnings.warn(
/usr/local/lib/python3.8/dist-packages/urllib3/connectionpool.py:1043: InsecureRequestWarning: Unverified HTTPS request is being made to host '172.21.249.142'. Adding certificate verification is strongly advised. See: https://urllib3.readthedocs.io/en/1.26.x/advanced-usage.html#ssl-warnings
  warnings.warn(
/usr/local/lib/python3.8/dist-packages/urllib3/connectionpool.py:1043: InsecureRequestWarning: Unverified HTTPS request is being made to host '172.21.249.142'. Adding certificate verification is strongly advised. See: https://urllib3.readthedocs.io/en/1.26.x/advanced-usage.html#ssl-warnings
  warnings.warn(
/usr/local/lib/python3.8/dist-packages/urllib3/connectionpool.py:1043: InsecureRequestWarning: Unverified HTTPS request is being made to host '172.21.249.142'. Adding certificate verification is strongly advised. See: https://urllib3.readthedocs.io/en/1.26.x/advanced-usage.html#ssl-warnings
  warnings.warn(
/usr/local/lib/python3.8/dist-packages/urllib3/connectionpool.py:1043: InsecureRequestWarning: Unverified HTTPS request is being made to host '172.21.249.142'. Adding certificate verification is strongly advised. See: https://urllib3.readthedocs.io/en/1.26.x/advanced-usage.html#ssl-warnings
  warnings.warn(
/usr/local/lib/python3.8/dist-packages/urllib3/connectionpool.py:1043: InsecureRequestWarning: Unverified HTTPS request is being made to host '172.21.249.142'. Adding certificate verification is strongly advised. See: https://urllib3.readthedocs.io/en/1.26.x/advanced-usage.html#ssl-warnings
  warnings.warn(
/usr/local/lib/python3.8/dist-packages/urllib3/connectionpool.py:1043: InsecureRequestWarning: Unverified HTTPS request is being made to host '172.21.249.142'. Adding certificate verification is strongly advised. See: https://urllib3.readthedocs.io/en/1.26.x/advanced-usage.html#ssl-warnings
  warnings.warn(
/usr/local/lib/python3.8/dist-packages/urllib3/connectionpool.py:1043: InsecureRequestWarning: Unverified HTTPS request is being made to host '172.21.249.142'. Adding certificate verification is strongly advised. See: https://urllib3.readthedocs.io/en/1.26.x/advanced-usage.html#ssl-warnings
  warnings.warn(
/usr/local/lib/python3.8/dist-packages/urllib3/connectionpool.py:1043: InsecureRequestWarning: Unverified HTTPS request is being made to host '172.21.249.142'. Adding certificate verification is strongly advised. See: https://urllib3.readthedocs.io/en/1.26.x/advanced-usage.html#ssl-warnings
  warnings.warn(
/usr/local/lib/python3.8/dist-packages/urllib3/connectionpool.py:1043: InsecureRequestWarning: Unverified HTTPS request is being made to host '172.21.249.142'. Adding certificate verification is strongly advised. See: https://urllib3.readthedocs.io/en/1.26.x/advanced-usage.html#ssl-warnings
  warnings.warn(
/usr/local/lib/python3.8/dist-packages/urllib3/connectionpool.py:1043: InsecureRequestWarning: Unverified HTTPS request is being made to host '172.21.249.142'. Adding certificate verification is strongly advised. See: https://urllib3.readthedocs.io/en/1.26.x/advanced-usage.html#ssl-warnings
  warnings.warn(
/usr/local/lib/python3.8/dist-packages/urllib3/connectionpool.py:1043: InsecureRequestWarning: Unverified HTTPS request is being made to host '172.21.249.142'. Adding certificate verification is strongly advised. See: https://urllib3.readthedocs.io/en/1.26.x/advanced-usage.html#ssl-warnings
  warnings.warn(
/usr/local/lib/python3.8/dist-packages/urllib3/connectionpool.py:1043: InsecureRequestWarning: Unverified HTTPS request is being made to host '172.21.249.142'. Adding certificate verification is strongly advised. See: https://urllib3.readthedocs.io/en/1.26.x/advanced-usage.html#ssl-warnings
  warnings.warn(
/usr/local/lib/python3.8/dist-packages/urllib3/connectionpool.py:1043: InsecureRequestWarning: Unverified HTTPS request is being made to host '172.21.249.142'. Adding certificate verification is strongly advised. See: https://urllib3.readthedocs.io/en/1.26.x/advanced-usage.html#ssl-warnings
  warnings.warn(
/usr/local/lib/python3.8/dist-packages/urllib3/connectionpool.py:1043: InsecureRequestWarning: Unverified HTTPS request is being made to host '172.21.249.142'. Adding certificate verification is strongly advised. See: https://urllib3.readthedocs.io/en/1.26.x/advanced-usage.html#ssl-warnings
  warnings.warn(
/usr/local/lib/python3.8/dist-packages/urllib3/connectionpool.py:1043: InsecureRequestWarning: Unverified HTTPS request is being made to host '172.21.249.142'. Adding certificate verification is strongly advised. See: https://urllib3.readthedocs.io/en/1.26.x/advanced-usage.html#ssl-warnings
  warnings.warn(
/usr/local/lib/python3.8/dist-packages/urllib3/connectionpool.py:1043: InsecureRequestWarning: Unverified HTTPS request is being made to host '172.21.249.142'. Adding certificate verification is strongly advised. See: https://urllib3.readthedocs.io/en/1.26.x/advanced-usage.html#ssl-warnings
  warnings.warn(
| PASS |
------------------------------------------------------------------------------
Delete VNF :: Test case to delete VNF                                 | PASS |
------------------------------------------------------------------------------
Delete VNF Descriptor Test                                            | PASS |
------------------------------------------------------------------------------
Testsuite.Sol003 01-Vnf-Lifecycle-Management :: [SOL003-01] Sol003... | PASS |
10 tests, 10 passed, 0 failed
==============================================================================
Testsuite                                                             | FAIL |
530 tests, 449 passed, 81 failed
==============================================================================
Output:  /robot-systest/reports/output.xml
Log:     /robot-systest/reports/log.html
Report:  /robot-systest/reports/report.html
/usr/local/lib/python3.8/dist-packages/urllib3/connectionpool.py:1043: InsecureRequestWarning: Unverified HTTPS request is being made to host '172.21.249.142'. Adding certificate verification is strongly advised. See: https://urllib3.readthedocs.io/en/1.26.x/advanced-usage.html#ssl-warnings
  warnings.warn(
/usr/local/lib/python3.8/dist-packages/urllib3/connectionpool.py:1043: InsecureRequestWarning: Unverified HTTPS request is being made to host '172.21.249.142'. Adding certificate verification is strongly advised. See: https://urllib3.readthedocs.io/en/1.26.x/advanced-usage.html#ssl-warnings
  warnings.warn(
/usr/local/lib/python3.8/dist-packages/urllib3/connectionpool.py:1043: InsecureRequestWarning: Unverified HTTPS request is being made to host '172.21.249.142'. Adding certificate verification is strongly advised. See: https://urllib3.readthedocs.io/en/1.26.x/advanced-usage.html#ssl-warnings
  warnings.warn(
/usr/local/lib/python3.8/dist-packages/urllib3/connectionpool.py:1043: InsecureRequestWarning: Unverified HTTPS request is being made to host '172.21.249.142'. Adding certificate verification is strongly advised. See: https://urllib3.readthedocs.io/en/1.26.x/advanced-usage.html#ssl-warnings
  warnings.warn(
/usr/local/lib/python3.8/dist-packages/urllib3/connectionpool.py:1043: InsecureRequestWarning: Unverified HTTPS request is being made to host '172.21.249.142'. Adding certificate verification is strongly advised. See: https://urllib3.readthedocs.io/en/1.26.x/advanced-usage.html#ssl-warnings
  warnings.warn(
[Pipeline] sh
[osm-devops] Running shell script
+ cp /tmp/tmp.hCwivMsZ87/log.html /tmp/tmp.hCwivMsZ87/output.xml /tmp/tmp.hCwivMsZ87/report.html .
[Pipeline] sh
[osm-devops] Running shell script
+ pwd
[Pipeline] echo
Present Directory is : /tmp/tmp.Ht2dThl7Re/usr/share/osm-devops
[Pipeline] step
Robot results publisher started...
-Parsing output xml:
Done!
-Copying log files to build dir:
Done!
-Assigning results to build:
Done!
-Checking thresholds:
Done!
Done publishing Robot results.
[Pipeline] }
[Pipeline] // stage
[Pipeline] stage
[Pipeline] { (After System Integration test)
[Pipeline] }
[Pipeline] // stage
[Pipeline] stage
[Pipeline] { (Archive)
[Pipeline] dir
Running in /home/jenkins/workspace/osm-stage_3-merge_v12.0/repo/release
[Pipeline] {
[Pipeline] getArtifactoryServer
[Pipeline] newBuildInfo
[Pipeline] artifactoryUpload
[consumer_0] Deploying artifact: https://artifactory-osm.etsi.org/artifactory/osm-release/v12.0/660/dists/unstable/devops/binary-amd64/Packages.gz
[consumer_2] Deploying artifact: https://artifactory-osm.etsi.org/artifactory/osm-release/v12.0/660/dists/unstable/IM/binary-amd64/Packages.gz
[consumer_1] Deploying artifact: https://artifactory-osm.etsi.org/artifactory/osm-release/v12.0/660/dists/unstable/osmclient/binary-amd64/Packages.gz
[consumer_2] Deploying artifact: https://artifactory-osm.etsi.org/artifactory/osm-release/v12.0/660/dists/unstable/devops/binary-amd64/Packages
[consumer_1] Deploying artifact: https://artifactory-osm.etsi.org/artifactory/osm-release/v12.0/660/dists/unstable/osmclient/binary-amd64/Packages
[consumer_1] Deploying artifact: https://artifactory-osm.etsi.org/artifactory/osm-release/v12.0/660/dists/unstable/IM/binary-amd64/Packages
[consumer_0] Deploying artifact: https://artifactory-osm.etsi.org/artifactory/osm-release/v12.0/660/pool/devops/osm-devops_12.0.7.post1-1_all.deb
[consumer_2] Deploying artifact: https://artifactory-osm.etsi.org/artifactory/osm-release/v12.0/660/pool/osmclient/python3-osmclient_12.0.7.post1%2Bgcd21ec6-1_all.deb
[consumer_1] Deploying artifact: https://artifactory-osm.etsi.org/artifactory/osm-release/v12.0/660/pool/IM/osm-imdocs_12.0.7-ga96212e_all.deb
[consumer_2] Deploying artifact: https://artifactory-osm.etsi.org/artifactory/osm-release/v12.0/660/pool/IM/python3-osm-im_12.0.7%2Bga96212e-1_all.deb
[Pipeline] publishBuildInfo
Deploying build info to: https://artifactory-osm.etsi.org/artifactory/api/build
Deploying build descriptor to: https://artifactory-osm.etsi.org/artifactory/api/build
Build successfully deployed. Browse it in Artifactory under https://artifactory-osm.etsi.org/artifactory/webapp/builds/osm-stage_3-merge%20::%20v12.0/660
[release] Running shell script
[Pipeline] sh
+ env
[Pipeline] step
Archiving artifacts
Recording fingerprints
[Pipeline] }
[Pipeline] // dir
[Pipeline] stage
[Pipeline] { (Publish to Dockerhub)
[Pipeline] parallel
[Pipeline] [NG-UI] { (Branch: NG-UI)
[Pipeline] [PLA] { (Branch: PLA)
[Pipeline] [tests] { (Branch: tests)
[Pipeline] [RO] { (Branch: RO)
[Pipeline] [NBI] { (Branch: NBI)
[Pipeline] [POL] { (Branch: POL)
[Pipeline] [Prometheus] { (Branch: Prometheus)
[Pipeline] [Keystone] { (Branch: Keystone)
[Pipeline] [osmclient] { (Branch: osmclient)
[Pipeline] [MON] { (Branch: MON)
[Pipeline] [LCM] { (Branch: LCM)
[Pipeline] [NG-UI] dir
[NG-UI] Running in /tmp/tmp.Ht2dThl7Re/usr/share/osm-devops/NG-UI
[Pipeline] [NG-UI] {
[Pipeline] [PLA] dir
[PLA] Running in /tmp/tmp.Ht2dThl7Re/usr/share/osm-devops/PLA
[Pipeline] [PLA] {
[Pipeline] [tests] dir
[tests] Running in /tmp/tmp.Ht2dThl7Re/usr/share/osm-devops/tests
[Pipeline] [tests] {
[Pipeline] [RO] dir
[RO] Running in /tmp/tmp.Ht2dThl7Re/usr/share/osm-devops/RO
[Pipeline] [RO] {
[Pipeline] [NBI] dir
[NBI] Running in /tmp/tmp.Ht2dThl7Re/usr/share/osm-devops/NBI
[Pipeline] [NBI] {
[Pipeline] [POL] dir
[POL] Running in /tmp/tmp.Ht2dThl7Re/usr/share/osm-devops/POL
[Pipeline] [POL] {
[Pipeline] [Prometheus] dir
[Prometheus] Running in /tmp/tmp.Ht2dThl7Re/usr/share/osm-devops/Prometheus
[Pipeline] [Prometheus] {
[Pipeline] [Keystone] dir
[Keystone] Running in /tmp/tmp.Ht2dThl7Re/usr/share/osm-devops/Keystone
[Pipeline] [Keystone] {
[Pipeline] [osmclient] dir
[osmclient] Running in /tmp/tmp.Ht2dThl7Re/usr/share/osm-devops/osmclient
[Pipeline] [osmclient] {
[Pipeline] [MON] dir
[MON] Running in /tmp/tmp.Ht2dThl7Re/usr/share/osm-devops/MON
[Pipeline] [MON] {
[Pipeline] [LCM] dir
[LCM] Running in /tmp/tmp.Ht2dThl7Re/usr/share/osm-devops/LCM
[Pipeline] [LCM] {
[Pipeline] [NG-UI] sh
[NG-UI] [NG-UI] Running shell script
[NG-UI] + docker pull osm.etsi.org:5050/devops/cicd/opensourcemano/ng-ui:osm-v120-merge-660
[NG-UI] osm-v120-merge-660: Pulling from devops/cicd/opensourcemano/ng-ui
[NG-UI] Digest: sha256:8ffc346fe56756c4c1fcba3488afc78e480c7da0449867940e04ed9b37b51936
[NG-UI] Status: Image is up to date for osm.etsi.org:5050/devops/cicd/opensourcemano/ng-ui:osm-v120-merge-660
[NG-UI] osm.etsi.org:5050/devops/cicd/opensourcemano/ng-ui:osm-v120-merge-660
[Pipeline] [PLA] sh
[PLA] [PLA] Running shell script
[PLA] + docker pull osm.etsi.org:5050/devops/cicd/opensourcemano/pla:osm-v120-merge-660
[PLA] osm-v120-merge-660: Pulling from devops/cicd/opensourcemano/pla
[PLA] Digest: sha256:7a6cf31c8423941faf904b12960d6380c10d74df2ecfacbb6032b9ef1447fcec
[PLA] Status: Image is up to date for osm.etsi.org:5050/devops/cicd/opensourcemano/pla:osm-v120-merge-660
[PLA] osm.etsi.org:5050/devops/cicd/opensourcemano/pla:osm-v120-merge-660
[Pipeline] [tests] sh
[tests] [tests] Running shell script
[tests] + docker pull osm.etsi.org:5050/devops/cicd/opensourcemano/tests:osm-v120-merge-660
[tests] osm-v120-merge-660: Pulling from devops/cicd/opensourcemano/tests
[tests] Digest: sha256:4ff8fd2a6d794729cc7415d87b8f31390a8a5bda34da75c84f0a3200aa46820d
[tests] Status: Image is up to date for osm.etsi.org:5050/devops/cicd/opensourcemano/tests:osm-v120-merge-660
[tests] osm.etsi.org:5050/devops/cicd/opensourcemano/tests:osm-v120-merge-660
[RO] [RO] Running shell script
[RO] + docker pull osm.etsi.org:5050/devops/cicd/opensourcemano/ro:osm-v120-merge-660
[RO] osm-v120-merge-660: Pulling from devops/cicd/opensourcemano/ro
[RO] Digest: sha256:7ba0beafb782e5b836afa0d0231336cc87cff468581a7eeb720db62c58949c87
[RO] Status: Image is up to date for osm.etsi.org:5050/devops/cicd/opensourcemano/ro:osm-v120-merge-660
[RO] osm.etsi.org:5050/devops/cicd/opensourcemano/ro:osm-v120-merge-660
[Pipeline] [RO] sh
[Pipeline] [NBI] sh
[NBI] [NBI] Running shell script
[NBI] + docker pull osm.etsi.org:5050/devops/cicd/opensourcemano/nbi:osm-v120-merge-660
[NBI] osm-v120-merge-660: Pulling from devops/cicd/opensourcemano/nbi
[NBI] Digest: sha256:221f94e787ce6a0be1bd53297344169f688702c40a08360a295b6205e0a7e786
[NBI] Status: Image is up to date for osm.etsi.org:5050/devops/cicd/opensourcemano/nbi:osm-v120-merge-660
[NBI] osm.etsi.org:5050/devops/cicd/opensourcemano/nbi:osm-v120-merge-660
[Pipeline] [POL] sh
[POL] [POL] Running shell script
[POL] + docker pull osm.etsi.org:5050/devops/cicd/opensourcemano/pol:osm-v120-merge-660
[POL] osm-v120-merge-660: Pulling from devops/cicd/opensourcemano/pol
[POL] Digest: sha256:28db8eb8434041403c3d0af4b0a13f2fb017964ae1c946e22fe3e0c36d44c4e6
[POL] Status: Image is up to date for osm.etsi.org:5050/devops/cicd/opensourcemano/pol:osm-v120-merge-660
[POL] osm.etsi.org:5050/devops/cicd/opensourcemano/pol:osm-v120-merge-660
[Pipeline] [Prometheus] sh
[Prometheus] [Prometheus] Running shell script
[Prometheus] + docker pull osm.etsi.org:5050/devops/cicd/opensourcemano/prometheus:osm-v120-merge-660
[Prometheus] osm-v120-merge-660: Pulling from devops/cicd/opensourcemano/prometheus
[Prometheus] Digest: sha256:2fe903db0f958b15bc0ca42644979ffee7428921e46e9791bf2a28bb74ff6183
[Prometheus] Status: Image is up to date for osm.etsi.org:5050/devops/cicd/opensourcemano/prometheus:osm-v120-merge-660
[Prometheus] osm.etsi.org:5050/devops/cicd/opensourcemano/prometheus:osm-v120-merge-660
[Pipeline] [Keystone] sh
[Keystone] [Keystone] Running shell script
[Keystone] + docker pull osm.etsi.org:5050/devops/cicd/opensourcemano/keystone:osm-v120-merge-660
[Pipeline] [osmclient] sh
[osmclient] [osmclient] Running shell script
[osmclient] + docker pull osm.etsi.org:5050/devops/cicd/opensourcemano/osmclient:osm-v120-merge-660
[Pipeline] [MON] sh
[Keystone] osm-v120-merge-660: Pulling from devops/cicd/opensourcemano/keystone
[Keystone] Digest: sha256:f374616f4f71c6960f2f3d48d3c8e4cb1bd32794d79f0336c1e79701822e6a04
[Keystone] Status: Image is up to date for osm.etsi.org:5050/devops/cicd/opensourcemano/keystone:osm-v120-merge-660
[Keystone] osm.etsi.org:5050/devops/cicd/opensourcemano/keystone:osm-v120-merge-660
[MON] [MON] Running shell script
[MON] + docker pull osm.etsi.org:5050/devops/cicd/opensourcemano/mon:osm-v120-merge-660
[Pipeline] [LCM] sh
[osmclient] osm-v120-merge-660: Pulling from devops/cicd/opensourcemano/osmclient
[osmclient] Digest: sha256:3ed91ba59c3e6abad3bdb81b8ecc689a9977b6378a393ce0fbfcc11eed8772b1
[osmclient] Status: Image is up to date for osm.etsi.org:5050/devops/cicd/opensourcemano/osmclient:osm-v120-merge-660
[osmclient] osm.etsi.org:5050/devops/cicd/opensourcemano/osmclient:osm-v120-merge-660
[MON] osm-v120-merge-660: Pulling from devops/cicd/opensourcemano/mon
[MON] Digest: sha256:283d74c182b742ee0afbb6e6ba5d87add7d6be30c67f9c097d5726aa68af0e5d
[MON] Status: Image is up to date for osm.etsi.org:5050/devops/cicd/opensourcemano/mon:osm-v120-merge-660
[MON] osm.etsi.org:5050/devops/cicd/opensourcemano/mon:osm-v120-merge-660
[LCM] [LCM] Running shell script
[LCM] + docker pull osm.etsi.org:5050/devops/cicd/opensourcemano/lcm:osm-v120-merge-660
[LCM] osm-v120-merge-660: Pulling from devops/cicd/opensourcemano/lcm
[LCM] Digest: sha256:697185048922634f8c0367802f009867b264600a3319a40d015d6690b7e74b97
[LCM] Status: Image is up to date for osm.etsi.org:5050/devops/cicd/opensourcemano/lcm:osm-v120-merge-660
[LCM] osm.etsi.org:5050/devops/cicd/opensourcemano/lcm:osm-v120-merge-660
[Pipeline] [NG-UI] sh
[NG-UI] [NG-UI] Running shell script
[NG-UI] + docker tag osm.etsi.org:5050/devops/cicd/opensourcemano/ng-ui:osm-v120-merge-660 opensourcemano/ng-ui:releasetwelve-daily
[Pipeline] [PLA] sh
[PLA] [PLA] Running shell script
[PLA] + docker tag osm.etsi.org:5050/devops/cicd/opensourcemano/pla:osm-v120-merge-660 opensourcemano/pla:releasetwelve-daily
[Pipeline] [tests] sh
[tests] [tests] Running shell script
[tests] + docker tag osm.etsi.org:5050/devops/cicd/opensourcemano/tests:osm-v120-merge-660 opensourcemano/tests:releasetwelve-daily
[Pipeline] [RO] sh
[RO] [RO] Running shell script
[RO] + docker tag osm.etsi.org:5050/devops/cicd/opensourcemano/ro:osm-v120-merge-660 opensourcemano/ro:releasetwelve-daily
[Pipeline] [NBI] sh
[NBI] [NBI] Running shell script
[NBI] + docker tag osm.etsi.org:5050/devops/cicd/opensourcemano/nbi:osm-v120-merge-660 opensourcemano/nbi:releasetwelve-daily
[Pipeline] [POL] sh
[POL] [POL] Running shell script
[POL] + docker tag osm.etsi.org:5050/devops/cicd/opensourcemano/pol:osm-v120-merge-660 opensourcemano/pol:releasetwelve-daily
[Pipeline] [Prometheus] sh
[Prometheus] [Prometheus] Running shell script
[Prometheus] + docker tag osm.etsi.org:5050/devops/cicd/opensourcemano/prometheus:osm-v120-merge-660 opensourcemano/prometheus:releasetwelve-daily
[Pipeline] [Keystone] sh
[Keystone] [Keystone] Running shell script
[Keystone] + docker tag osm.etsi.org:5050/devops/cicd/opensourcemano/keystone:osm-v120-merge-660 opensourcemano/keystone:releasetwelve-daily
[Pipeline] [osmclient] sh
[osmclient] [osmclient] Running shell script
[Pipeline] [LCM] sh
[osmclient] + docker tag osm.etsi.org:5050/devops/cicd/opensourcemano/osmclient:osm-v120-merge-660 opensourcemano/osmclient:releasetwelve-daily
[LCM] [LCM] Running shell script
[LCM] + docker tag osm.etsi.org:5050/devops/cicd/opensourcemano/lcm:osm-v120-merge-660 opensourcemano/lcm:releasetwelve-daily
[Pipeline] [NG-UI] sh
[NG-UI] [NG-UI] Running shell script
[NG-UI] + docker push opensourcemano/ng-ui:releasetwelve-daily
[NG-UI] The push refers to repository [docker.io/opensourcemano/ng-ui]
[Pipeline] [PLA] sh
[PLA] [PLA] Running shell script
[PLA] + docker push opensourcemano/pla:releasetwelve-daily
[PLA] The push refers to repository [docker.io/opensourcemano/pla]
[Pipeline] [tests] sh
[NG-UI] adaa43fcf516: Preparing
[NG-UI] 710ee635540c: Preparing
[NG-UI] 96b7cfd22186: Preparing
[NG-UI] 1e20c795a10e: Preparing
[NG-UI] 4d938b55d951: Preparing
[NG-UI] 28da0445c449: Preparing
[NG-UI] 28da0445c449: Waiting
[tests] [tests] Running shell script
[tests] + docker push opensourcemano/tests:releasetwelve-daily
[tests] The push refers to repository [docker.io/opensourcemano/tests]
[Pipeline] [RO] sh
[RO] [RO] Running shell script
[RO] + docker push opensourcemano/ro:releasetwelve-daily
[RO] The push refers to repository [docker.io/opensourcemano/ro]
[Pipeline] [NBI] sh
[NBI] [NBI] Running shell script
[Pipeline] [MON] sh
[PLA] 95104e5d05b6: Preparing
[PLA] 23aaa28f4fcc: Preparing
[PLA] d1954e4bccfc: Preparing
[PLA] 322c89405637: Preparing
[PLA] b2c08615adb1: Preparing
[PLA] 9207523788ed: Preparing
[PLA] 777b68322928: Preparing
[PLA] ff98837ccb45: Preparing
[PLA] 4d938b55d951: Preparing
[PLA] 28da0445c449: Preparing
[PLA] 23aaa28f4fcc: Waiting
[PLA] d1954e4bccfc: Waiting
[PLA] 322c89405637: Waiting
[PLA] 95104e5d05b6: Waiting
[PLA] 4d938b55d951: Waiting
[PLA] 9207523788ed: Waiting
[PLA] 28da0445c449: Waiting
[PLA] 777b68322928: Waiting
[tests] 39729fc4a291: Preparing
[tests] 6f88c5a8ae68: Preparing
[tests] 2d8c81bfc2d8: Preparing
[tests] 6323a1b83d66: Preparing
[tests] 131a4e7a678c: Preparing
[tests] badf14f02195: Preparing
[tests] 39729fc4a291: Waiting
[tests] 50941e950d54: Preparing
[tests] 6f88c5a8ae68: Waiting
[tests] e7c1564d98d5: Preparing
[tests] d76dea342900: Preparing
[tests] 2d8c81bfc2d8: Waiting
[tests] d07507375924: Preparing
[tests] d28b72034340: Preparing
[tests] 6323a1b83d66: Waiting
[tests] 622502ef9b65: Preparing
[tests] 131a4e7a678c: Waiting
[tests] db346a03be28: Preparing
[tests] 4d938b55d951: Preparing
[tests] 28da0445c449: Preparing
[tests] d07507375924: Waiting
[tests] 4d938b55d951: Waiting
[tests] 622502ef9b65: Waiting
[tests] 28da0445c449: Waiting
[tests] e7c1564d98d5: Waiting
[tests] 50941e950d54: Waiting
[tests] d28b72034340: Waiting
[tests] badf14f02195: Waiting
[RO] 8a2882c6332e: Preparing
[RO] 7e4eb69ff885: Preparing
[RO] ff2e945c384b: Preparing
[RO] 97518d3a9096: Preparing
[RO] 96a389d78d52: Preparing
[RO] 333bda1b6a70: Preparing
[RO] 4d938b55d951: Preparing
[RO] 28da0445c449: Preparing
[RO] 8a2882c6332e: Waiting
[RO] ff2e945c384b: Waiting
[RO] 7e4eb69ff885: Waiting
[RO] 97518d3a9096: Waiting
[RO] 4d938b55d951: Waiting
[RO] 333bda1b6a70: Waiting
[RO] 96a389d78d52: Waiting
[NBI] + docker push opensourcemano/nbi:releasetwelve-daily
[NBI] The push refers to repository [docker.io/opensourcemano/nbi]
[NBI] 18d0288d3560: Preparing
[NBI] d705f897543a: Preparing
[NBI] 8ab9a0e09a71: Preparing
[NBI] 4b1c2701399a: Preparing
[NBI] 412e9aa83c6c: Preparing
[NBI] 0409d63fa0db: Preparing
[NBI] fdbf8b97d15d: Preparing
[NBI] 4d938b55d951: Preparing
[NBI] 28da0445c449: Preparing
[NBI] 18d0288d3560: Waiting
[NBI] fdbf8b97d15d: Waiting
[NBI] d705f897543a: Waiting
[NBI] 412e9aa83c6c: Waiting
[NBI] 0409d63fa0db: Waiting
[NBI] 8ab9a0e09a71: Waiting
[NBI] 28da0445c449: Waiting
[NBI] 4b1c2701399a: Waiting
[MON] [MON] Running shell script
[MON] + docker tag osm.etsi.org:5050/devops/cicd/opensourcemano/mon:osm-v120-merge-660 opensourcemano/mon:releasetwelve-daily
[Pipeline] [POL] sh
[POL] [POL] Running shell script
[Pipeline] [Prometheus] sh
[Prometheus] [Prometheus] Running shell script
[Pipeline] [Keystone] sh
[Keystone] [Keystone] Running shell script
[Pipeline] [osmclient] sh
[POL] + docker push opensourcemano/pol:releasetwelve-daily
[POL] The push refers to repository [docker.io/opensourcemano/pol]
[POL] d3047b197e91: Preparing
[POL] b8478fce68ba: Preparing
[POL] 9db9a482fb7c: Preparing
[POL] 7e8ebbc4b873: Preparing
[POL] c956bcad59de: Preparing
[POL] 913ff91baee9: Preparing
[POL] 9747472f0ce2: Preparing
[POL] 48b89d47d994: Preparing
[POL] e1d272518260: Preparing
[POL] 46eaaadfbbcb: Preparing
[POL] 333bda1b6a70: Preparing
[POL] 4d938b55d951: Preparing
[POL] 28da0445c449: Preparing
[POL] d3047b197e91: Waiting
[POL] b8478fce68ba: Waiting
[POL] 48b89d47d994: Waiting
[POL] 9db9a482fb7c: Waiting
[POL] e1d272518260: Waiting
[POL] c956bcad59de: Waiting
[POL] 9747472f0ce2: Waiting
[POL] 913ff91baee9: Waiting
[POL] 46eaaadfbbcb: Waiting
[POL] 4d938b55d951: Waiting
[POL] 28da0445c449: Waiting
[POL] 333bda1b6a70: Waiting
[Prometheus] + docker push opensourcemano/prometheus:releasetwelve-daily
[Prometheus] The push refers to repository [docker.io/opensourcemano/prometheus]
[Keystone] + docker push opensourcemano/keystone:releasetwelve-daily
[Keystone] The push refers to repository [docker.io/opensourcemano/keystone]
[osmclient] [osmclient] Running shell script
[osmclient] + docker push opensourcemano/osmclient:releasetwelve-daily
[osmclient] The push refers to repository [docker.io/opensourcemano/osmclient]
[Pipeline] [LCM] sh
[LCM] [LCM] Running shell script
[Prometheus] 97c7907f2a12: Preparing
[Prometheus] d9bad5f90d84: Preparing
[Prometheus] b1afde34a74c: Preparing
[Prometheus] 240df17b9967: Preparing
[Prometheus] 6e751b5b0bee: Preparing
[Prometheus] 126cdbcad241: Preparing
[Prometheus] 01589a17de95: Preparing
[Prometheus] 84f540ade319: Preparing
[Prometheus] 9fe4e8a1862c: Preparing
[Prometheus] 909275a3eaaa: Preparing
[Prometheus] f3f47b3309ca: Preparing
[Prometheus] 1a5fc1184c48: Preparing
[Prometheus] 01589a17de95: Waiting
[Prometheus] 97c7907f2a12: Waiting
[Prometheus] 84f540ade319: Waiting
[Prometheus] 240df17b9967: Waiting
[Prometheus] f3f47b3309ca: Waiting
[Prometheus] 909275a3eaaa: Waiting
[Prometheus] b1afde34a74c: Waiting
[Prometheus] 1a5fc1184c48: Waiting
[Prometheus] 126cdbcad241: Waiting
[Keystone] fe4750ca2dd6: Preparing
[Keystone] 21765fa2e0e1: Preparing
[Keystone] ec605d22e285: Preparing
[Keystone] 95f0232bb0b2: Preparing
[Keystone] ee13a8704327: Preparing
[Keystone] 4d938b55d951: Preparing
[Keystone] 28da0445c449: Preparing
[Keystone] fe4750ca2dd6: Waiting
[Keystone] 21765fa2e0e1: Waiting
[Keystone] ec605d22e285: Waiting
[Keystone] 95f0232bb0b2: Waiting
[Keystone] 28da0445c449: Waiting
[Keystone] ee13a8704327: Waiting
[Keystone] 4d938b55d951: Waiting
[Pipeline] [MON] sh
[osmclient] c75f4a05afef: Preparing
[osmclient] ffd1ced22b52: Preparing
[osmclient] fdbf8b97d15d: Preparing
[osmclient] 4d938b55d951: Preparing
[osmclient] 28da0445c449: Preparing
[osmclient] c75f4a05afef: Waiting
[osmclient] ffd1ced22b52: Waiting
[osmclient] fdbf8b97d15d: Waiting
[osmclient] 4d938b55d951: Waiting
[osmclient] 28da0445c449: Waiting
[LCM] + docker push opensourcemano/lcm:releasetwelve-daily
[LCM] The push refers to repository [docker.io/opensourcemano/lcm]
[LCM] 2a49cf8f35a8: Preparing
[LCM] 617c2b7a84d2: Preparing
[LCM] 09dbd9c18d1d: Preparing
[LCM] 00b2c82ee342: Preparing
[LCM] 5036d00cb5b2: Preparing
[LCM] bb0eb1988dce: Preparing
[LCM] 09dbd9c18d1d: Waiting
[LCM] 617c2b7a84d2: Waiting
[LCM] 00b2c82ee342: Waiting
[LCM] 2a49cf8f35a8: Waiting
[LCM] 33d22d02ed93: Preparing
[LCM] 75d1d7909867: Preparing
[LCM] b992a0582478: Preparing
[LCM] 2ba81ea2a827: Preparing
[LCM] 311ae69d9e83: Preparing
[LCM] 18e4a848fb9d: Preparing
[LCM] 677a17649c3d: Preparing
[LCM] 333bda1b6a70: Preparing
[LCM] 4d938b55d951: Preparing
[LCM] 28da0445c449: Preparing
[LCM] bb0eb1988dce: Waiting
[LCM] 311ae69d9e83: Waiting
[LCM] 18e4a848fb9d: Waiting
[LCM] 33d22d02ed93: Waiting
[LCM] 677a17649c3d: Waiting
[LCM] b992a0582478: Waiting
[LCM] 4d938b55d951: Waiting
[LCM] 333bda1b6a70: Waiting
[LCM] 2ba81ea2a827: Waiting
[LCM] 28da0445c449: Waiting
[MON] [MON] Running shell script
[MON] + docker push opensourcemano/mon:releasetwelve-daily
[MON] The push refers to repository [docker.io/opensourcemano/mon]
[MON] 4f78d55ba97a: Preparing
[MON] b835267429d1: Preparing
[MON] 0deea6030d7d: Preparing
[MON] 0736d0dae57f: Preparing
[MON] 680c9e2db337: Preparing
[MON] 3c0bbbad25bd: Preparing
[MON] 091db31e642f: Preparing
[MON] b835267429d1: Waiting
[MON] 0deea6030d7d: Waiting
[MON] 4f78d55ba97a: Waiting
[MON] 0736d0dae57f: Waiting
[MON] 680c9e2db337: Waiting
[MON] ff35c766ca36: Preparing
[MON] 23230ed3acdf: Preparing
[MON] f7d596b63fcf: Preparing
[MON] 677a17649c3d: Preparing
[MON] 333bda1b6a70: Preparing
[MON] 4d938b55d951: Preparing
[MON] 28da0445c449: Preparing
[MON] 091db31e642f: Waiting
[MON] ff35c766ca36: Waiting
[MON] 23230ed3acdf: Waiting
[MON] f7d596b63fcf: Waiting
[MON] 677a17649c3d: Waiting
[MON] 4d938b55d951: Waiting
[MON] 28da0445c449: Waiting
[MON] 333bda1b6a70: Waiting
[NG-UI] 4d938b55d951: Pushed
[NG-UI] 710ee635540c: Pushed
[NG-UI] 96b7cfd22186: Pushed
[NG-UI] 28da0445c449: Layer already exists
[NG-UI] adaa43fcf516: Pushed
[PLA] d1954e4bccfc: Pushed
[PLA] 23aaa28f4fcc: Pushed
[PLA] b2c08615adb1: Pushed
[NG-UI] 1e20c795a10e: Pushed
[PLA] 9207523788ed: Pushed
[PLA] 4d938b55d951: Mounted from opensourcemano/ng-ui
[PLA] 28da0445c449: Layer already exists
[PLA] 777b68322928: Pushed
[NG-UI] releasetwelve-daily: digest: sha256:23cc0024e68ea56724fe8aeed15404e8a3ea46b7ace8e333b19049f39c0b9261 size: 1573
[Pipeline] [NG-UI] }
[Pipeline] [NG-UI] // dir
[Pipeline] [NG-UI] }
[PLA] ff98837ccb45: Pushed
[tests] 6f88c5a8ae68: Pushed
[tests] 2d8c81bfc2d8: Pushed
[tests] 6323a1b83d66: Pushed
[tests] badf14f02195: Pushed
[tests] 50941e950d54: Pushed
[tests] e7c1564d98d5: Pushed
[PLA] 95104e5d05b6: Pushed
[PLA] 322c89405637: Pushed
[tests] d76dea342900: Pushed
[tests] d07507375924: Pushed
[tests] d28b72034340: Pushed
[PLA] releasetwelve-daily: digest: sha256:62898677a52fe087eb9009fc0bace65a9055d3af5cdf45a252df8a2cf06df105 size: 2418
[Pipeline] [PLA] }
[Pipeline] [PLA] // dir
[Pipeline] [PLA] }
[tests] 4d938b55d951: Mounted from opensourcemano/pla
[tests] 28da0445c449: Layer already exists
[tests] 131a4e7a678c: Pushed
[tests] 622502ef9b65: Pushed
[RO] 8a2882c6332e: Pushed
[RO] 7e4eb69ff885: Pushed
[RO] ff2e945c384b: Pushed
[RO] 96a389d78d52: Pushed
[RO] 28da0445c449: Layer already exists
[tests] 39729fc4a291: Pushed
[RO] 4d938b55d951: Mounted from opensourcemano/tests
[RO] 333bda1b6a70: Pushed
[NBI] d705f897543a: Pushed
[NBI] 18d0288d3560: Pushed
[NBI] 8ab9a0e09a71: Pushed
[NBI] 4b1c2701399a: Pushed
[NBI] 0409d63fa0db: Pushed
[NBI] 4d938b55d951: Mounted from opensourcemano/ro
[NBI] 28da0445c449: Layer already exists
[NBI] 412e9aa83c6c: Pushed
[NBI] fdbf8b97d15d: Pushed
[NBI] releasetwelve-daily: digest: sha256:b2b19c5fd489040bdadc82a405c1c71adf29d1f034393c8f3da4c661d88fba66 size: 2204
[Pipeline] [NBI] }
[Pipeline] [NBI] // dir
[Pipeline] [NBI] }
[POL] d3047b197e91: Pushed
[POL] b8478fce68ba: Pushed
[POL] 9db9a482fb7c: Pushed
[POL] 7e8ebbc4b873: Pushed
[POL] c956bcad59de: Pushed
[POL] 913ff91baee9: Pushed
[POL] 9747472f0ce2: Pushed
[POL] 48b89d47d994: Pushed
[POL] 333bda1b6a70: Mounted from opensourcemano/ro
[tests] db346a03be28: Pushed
[POL] 4d938b55d951: Mounted from opensourcemano/nbi
[POL] e1d272518260: Pushed
[POL] 28da0445c449: Layer already exists
[POL] 46eaaadfbbcb: Pushed
[POL] releasetwelve-daily: digest: sha256:d9173aafb7b7729454bb0a967d6d7b40635802bbb6d18b98e588c42164933399 size: 3043
[Pipeline] [POL] }
[Pipeline] [POL] // dir
[Pipeline] [POL] }
[tests] releasetwelve-daily: digest: sha256:cb61e400bc41fb3fb0f7719dbb6ed552651edebbc594119a48a3a1324e9c6009 size: 3470
[Pipeline] [tests] }
[Pipeline] [tests] // dir
[Pipeline] [tests] }
[Prometheus] 97c7907f2a12: Pushed
[Prometheus] b1afde34a74c: Pushed
[Prometheus] 6e751b5b0bee: Layer already exists
[Prometheus] 126cdbcad241: Layer already exists
[Prometheus] 01589a17de95: Layer already exists
[Prometheus] 84f540ade319: Layer already exists
[Prometheus] 9fe4e8a1862c: Layer already exists
[Prometheus] 240df17b9967: Pushed
[Prometheus] 909275a3eaaa: Layer already exists
[Prometheus] f3f47b3309ca: Layer already exists
[Prometheus] 1a5fc1184c48: Layer already exists
[Prometheus] d9bad5f90d84: Pushed
[Keystone] fe4750ca2dd6: Pushed
[Keystone] 95f0232bb0b2: Pushed
[Keystone] 28da0445c449: Layer already exists
[Prometheus] releasetwelve-daily: digest: sha256:2fe903db0f958b15bc0ca42644979ffee7428921e46e9791bf2a28bb74ff6183 size: 2841
[Pipeline] [Prometheus] }
[Keystone] ee13a8704327: Pushed
[Pipeline] [Prometheus] // dir
[Pipeline] [Prometheus] }
[Keystone] 4d938b55d951: Mounted from opensourcemano/pol
[Keystone] 21765fa2e0e1: Pushed
[RO] 97518d3a9096: Pushed
[RO] releasetwelve-daily: digest: sha256:efc6c80932b268e4adf19150c2749a17239f2c34d770d5ab501fd025b78308fa size: 1997
[Pipeline] [RO] }
[Pipeline] [RO] // dir
[Pipeline] [RO] }
[osmclient] fdbf8b97d15d: Mounted from opensourcemano/nbi
[osmclient] 4d938b55d951: Mounted from opensourcemano/keystone
[osmclient] 28da0445c449: Layer already exists
[osmclient] ffd1ced22b52: Pushed
[osmclient] c75f4a05afef: Pushed
[osmclient] releasetwelve-daily: digest: sha256:aa1e318d1fff9d0806fe6db69d8d08be8ff6999b17e06402d11650654bf04480 size: 1371
[Pipeline] [osmclient] }
[Pipeline] [osmclient] // dir
[Pipeline] [osmclient] }
[LCM] 617c2b7a84d2: Pushed
[LCM] 5036d00cb5b2: Pushed
[LCM] 2a49cf8f35a8: Pushed
[LCM] 33d22d02ed93: Pushed
[LCM] bb0eb1988dce: Pushed
[LCM] b992a0582478: Pushed
[LCM] 75d1d7909867: Pushed
[LCM] 09dbd9c18d1d: Pushed
[LCM] 00b2c82ee342: Pushed
[LCM] 18e4a848fb9d: Pushed
[LCM] 333bda1b6a70: Mounted from opensourcemano/pol
[LCM] 677a17649c3d: Pushed
[LCM] 4d938b55d951: Mounted from opensourcemano/osmclient
[LCM] 28da0445c449: Layer already exists
[LCM] 2ba81ea2a827: Pushed
[LCM] 311ae69d9e83: Pushed
[LCM] releasetwelve-daily: digest: sha256:3a445c969641222e9e3ceefce7e73e41a51f236d17c5981d9fe8765e6aaf158f size: 3688
[Pipeline] [LCM] }
[Pipeline] [LCM] // dir
[Pipeline] [LCM] }
[MON] 4f78d55ba97a: Pushed
[MON] b835267429d1: Pushed
[MON] 680c9e2db337: Pushed
[MON] 3c0bbbad25bd: Pushed
[MON] ff35c766ca36: Pushed
[MON] 091db31e642f: Pushed
[MON] 0deea6030d7d: Pushed
[MON] 677a17649c3d: Mounted from opensourcemano/lcm
[MON] 333bda1b6a70: Mounted from opensourcemano/lcm
[MON] 0736d0dae57f: Pushed
[MON] 28da0445c449: Layer already exists
[MON] 4d938b55d951: Mounted from opensourcemano/lcm
[MON] f7d596b63fcf: Pushed
[Keystone] ec605d22e285: Pushed
[Keystone] releasetwelve-daily: digest: sha256:673e3eff22373439cbd5469348d17840c72dbc5b3963382eca876ebbb2c64e7a size: 1783
[Pipeline] [Keystone] }
[Pipeline] [Keystone] // dir
[Pipeline] [Keystone] }
[MON] 23230ed3acdf: Pushed
[MON] releasetwelve-daily: digest: sha256:7c4969e10ffda749aa6f19e7f09a2364c2c9b56fb43988f2769164f9587bb199 size: 3257
[Pipeline] [MON] }
[Pipeline] [MON] // dir
[Pipeline] [MON] }
[Pipeline] // parallel
[Pipeline] }
[Pipeline] // stage
[Pipeline] stage
[Pipeline] { (Snap promotion)
[Pipeline] withCredentials
[Pipeline] {
[Pipeline] sh
[osm-devops] Running shell script
+ snapcraft revisions osmclient
+ grep 12.0/edge\*
+ tail -1
+ awk {print $1}
Starting Snapcraft 8.0.3
Logging execution to '/home/jenkins/.local/state/snapcraft/log/snapcraft-20240222-060439.148456.log'
[Pipeline] sh
[osm-devops] Running shell script
+ snapcraft revisions osmclient
+ grep 12.0/beta\*
+ tail -1
+ awk {print $1}
Starting Snapcraft 8.0.3
Logging execution to '/home/jenkins/.local/state/snapcraft/log/snapcraft-20240222-060442.103277.log'
[Pipeline] echo
Edge: 1527, Beta: 1527
[Pipeline] }
[Pipeline] // withCredentials
[Pipeline] }
[Pipeline] // stage
[Pipeline] }
[Pipeline] // stage
[Pipeline] }
[Pipeline] // dir
[Pipeline] stage
[Pipeline] { (Archive Container Logs)
[Pipeline] echo
Archiving container logs
[Pipeline] sshCommand
Host key checking is off. It may be vulnerable to man-in-the-middle attacks.
[jsch] Permanently added '172.21.249.142' (RSA) to the list of known hosts.
Connected to osm-v120-merge-660[172.21.249.142:22] (SSH-2.0-OpenSSH_8.2p1 Ubuntu-4ubuntu0.4)
Started command osm-v120-merge-660#4402: mkdir -p logs
Success command osm-v120-merge-660#4402: mkdir -p logs
Disconnected from osm-v120-merge-660[172.21.249.142:22]
[Pipeline] sshCommand
Host key checking is off. It may be vulnerable to man-in-the-middle attacks.
[jsch] Permanently added '172.21.249.142' (RSA) to the list of known hosts.
Connected to osm-v120-merge-660[172.21.249.142:22] (SSH-2.0-OpenSSH_8.2p1 Ubuntu-4ubuntu0.4)
Started command osm-v120-merge-660#4403: 
            for deployment in `kubectl -n osm get deployments | grep -v operator | grep -v NAME| awk '{print $1}'`; do
                echo "Extracting log for $deployment"
                kubectl -n osm logs deployments/$deployment --timestamps=true --all-containers 2>&1                 > logs/$deployment.log
            done
        
Extracting log for grafana
Extracting log for keystone
Extracting log for lcm
Extracting log for mon
Extracting log for nbi
Extracting log for ng-ui
Extracting log for pol
Extracting log for ro
Success command osm-v120-merge-660#4403: 
            for deployment in `kubectl -n osm get deployments | grep -v operator | grep -v NAME| awk '{print $1}'`; do
                echo "Extracting log for $deployment"
                kubectl -n osm logs deployments/$deployment --timestamps=true --all-containers 2>&1                 > logs/$deployment.log
            done
        
Disconnected from osm-v120-merge-660[172.21.249.142:22]
[Pipeline] sshCommand
Host key checking is off. It may be vulnerable to man-in-the-middle attacks.
[jsch] Permanently added '172.21.249.142' (RSA) to the list of known hosts.
Connected to osm-v120-merge-660[172.21.249.142:22] (SSH-2.0-OpenSSH_8.2p1 Ubuntu-4ubuntu0.4)
Started command osm-v120-merge-660#4404: 
            for statefulset in `kubectl -n osm get statefulsets | grep -v operator | grep -v NAME| awk '{print $1}'`; do
                echo "Extracting log for $statefulset"
                kubectl -n osm logs statefulsets/$statefulset --timestamps=true --all-containers 2>&1                 > logs/$statefulset.log
            done
        
Extracting log for kafka
Extracting log for mongodb-k8s
Extracting log for mysql
Extracting log for prometheus
Extracting log for zookeeper
Success command osm-v120-merge-660#4404: 
            for statefulset in `kubectl -n osm get statefulsets | grep -v operator | grep -v NAME| awk '{print $1}'`; do
                echo "Extracting log for $statefulset"
                kubectl -n osm logs statefulsets/$statefulset --timestamps=true --all-containers 2>&1                 > logs/$statefulset.log
            done
        
Disconnected from osm-v120-merge-660[172.21.249.142:22]
[Pipeline] sh
[osm-stage_3-merge_v12.0] Running shell script
+ rm -rf logs
[Pipeline] sshCommand
Host key checking is off. It may be vulnerable to man-in-the-middle attacks.
[jsch] Permanently added '172.21.249.142' (RSA) to the list of known hosts.
Connected to osm-v120-merge-660[172.21.249.142:22] (SSH-2.0-OpenSSH_8.2p1 Ubuntu-4ubuntu0.4)
Started command osm-v120-merge-660#4405: ls -al logs
total 55892
drwxrwxr-x 2 ubuntu ubuntu     4096 Feb 22 06:04 .
drwxr-xr-x 9 ubuntu ubuntu     4096 Feb 22 06:04 ..
-rw-rw-r-- 1 ubuntu ubuntu    61258 Feb 22 06:04 grafana.log
-rw-rw-r-- 1 ubuntu ubuntu   320433 Feb 22 06:04 kafka.log
-rw-rw-r-- 1 ubuntu ubuntu     9962 Feb 22 06:04 keystone.log
-rw-rw-r-- 1 ubuntu ubuntu 11129964 Feb 22 06:04 lcm.log
-rw-rw-r-- 1 ubuntu ubuntu  1738607 Feb 22 06:04 mon.log
-rw-rw-r-- 1 ubuntu ubuntu 21039969 Feb 22 06:04 mongodb-k8s.log
-rw-rw-r-- 1 ubuntu ubuntu    20659 Feb 22 06:04 mysql.log
-rw-rw-r-- 1 ubuntu ubuntu  3430645 Feb 22 06:04 nbi.log
-rw-rw-r-- 1 ubuntu ubuntu        0 Feb 22 06:04 ng-ui.log
-rw-rw-r-- 1 ubuntu ubuntu   136405 Feb 22 06:04 pol.log
-rw-rw-r-- 1 ubuntu ubuntu     7739 Feb 22 06:04 prometheus.log
-rw-rw-r-- 1 ubuntu ubuntu 19158261 Feb 22 06:04 ro.log
-rw-rw-r-- 1 ubuntu ubuntu   146053 Feb 22 06:04 zookeeper.log
Success command osm-v120-merge-660#4405: ls -al logs
Disconnected from osm-v120-merge-660[172.21.249.142:22]
[Pipeline] sshGet
Host key checking is off. It may be vulnerable to man-in-the-middle attacks.
[jsch] Permanently added '172.21.249.142' (RSA) to the list of known hosts.
Connected to osm-v120-merge-660[172.21.249.142:22] (SSH-2.0-OpenSSH_8.2p1 Ubuntu-4ubuntu0.4)
Received file from osm-v120-merge-660: grafana.log -> /home/jenkins/workspace/osm-stage_3-merge_v12.0/logs/grafana.log
Received file from osm-v120-merge-660: prometheus.log -> /home/jenkins/workspace/osm-stage_3-merge_v12.0/logs/prometheus.log
Received file from osm-v120-merge-660: ng-ui.log -> /home/jenkins/workspace/osm-stage_3-merge_v12.0/logs/ng-ui.log
Received file from osm-v120-merge-660: zookeeper.log -> /home/jenkins/workspace/osm-stage_3-merge_v12.0/logs/zookeeper.log
Received file from osm-v120-merge-660: lcm.log -> /home/jenkins/workspace/osm-stage_3-merge_v12.0/logs/lcm.log
Received file from osm-v120-merge-660: nbi.log -> /home/jenkins/workspace/osm-stage_3-merge_v12.0/logs/nbi.log
Received file from osm-v120-merge-660: pol.log -> /home/jenkins/workspace/osm-stage_3-merge_v12.0/logs/pol.log
Received file from osm-v120-merge-660: kafka.log -> /home/jenkins/workspace/osm-stage_3-merge_v12.0/logs/kafka.log
Received file from osm-v120-merge-660: ro.log -> /home/jenkins/workspace/osm-stage_3-merge_v12.0/logs/ro.log
Received file from osm-v120-merge-660: mysql.log -> /home/jenkins/workspace/osm-stage_3-merge_v12.0/logs/mysql.log
Received file from osm-v120-merge-660: keystone.log -> /home/jenkins/workspace/osm-stage_3-merge_v12.0/logs/keystone.log
Received file from osm-v120-merge-660: mon.log -> /home/jenkins/workspace/osm-stage_3-merge_v12.0/logs/mon.log
Received file from osm-v120-merge-660: mongodb-k8s.log -> /home/jenkins/workspace/osm-stage_3-merge_v12.0/logs/mongodb-k8s.log
Received directory from osm-v120-merge-660: logs -> /home/jenkins/workspace/osm-stage_3-merge_v12.0
Disconnected from osm-v120-merge-660[172.21.249.142:22]
[Pipeline] sh
[osm-stage_3-merge_v12.0] Running shell script
+ cp logs/grafana.log logs/kafka.log logs/keystone.log logs/lcm.log logs/mon.log logs/mongodb-k8s.log logs/mysql.log logs/nbi.log logs/ng-ui.log logs/pol.log logs/prometheus.log logs/ro.log logs/zookeeper.log .
[Pipeline] step
Archiving artifacts
[Pipeline] }
[Pipeline] // stage
[Pipeline] stage
[Pipeline] { (Cleanup)
[Pipeline] echo
Deleting VM: c3c30992-aa86-49c5-b931-75f2edf62c69
[Pipeline] sh
[osm-stage_3-merge_v12.0] Running shell script
[Pipeline] sh
[osm-stage_3-merge_v12.0] Running shell script
+ docker stop osm-v120-merge-660-apache
osm-v120-merge-660-apache
[Pipeline] sh
[osm-stage_3-merge_v12.0] Running shell script
+ docker rm osm-v120-merge-660-apache
osm-v120-merge-660-apache
[Pipeline] sh
[osm-stage_3-merge_v12.0] Running shell script
+ rm -rf /tmp/tmp.Ht2dThl7Re
[Pipeline] }
[Pipeline] // stage
[Pipeline] }
[Pipeline] // node
[Pipeline] End of Pipeline
Finished: UNSTABLE